program: Gaussian 09
title: 000276716
version: EM64L-G09RevD.01
frameworkgroup: C1[X(C17H16N2O2)]
method: RPBEPBE
basis: SDD
operation: Freq
keyword: #p
keyword: freq=noraman
keyword: PBEPBE/SDD
title: #p freq=noraman PBEPBE/SDD
converged: YES YES NO NO
title: Mulliken charges:
elementType: O O N N C C C C C C C C C C C C C C C C C H H H H H H H H H H H H H H H H
charge: -0.516508 -0.244508 0.052321 -0.433062 -0.445869 -0.551527 -0.546584 0.310190 0.296592 -0.572309 -0.432308 0.484258 -0.407773 -0.406257 0.089741 0.181923 0.257821 -0.308456 -0.387485 -0.245413 -0.199386 0.224458 0.217315 0.226803 0.232190 0.226949 0.225419 0.293410 0.238613 0.219151 0.202598 0.367985 0.284261 0.217416 0.236317 0.233671 0.378047
chargesum: 0.00000
title: Mulliken charges with hydrogens summed into heavy atoms:
elementType: O O N N C C C C C C C C C C C C C C C C C
charge: -0.138461 -0.244508 0.052321 -0.065077 -0.004096 -0.092535 -0.094217 0.310190 0.296592 -0.278899 -0.193695 0.484258 -0.188622 -0.203659 0.089741 0.181923 0.257821 -0.024195 -0.170069 -0.009096 0.034284
polarizability: 4.33968546e+02 -1.91120150e+01 2.14916437e+02 1.56158213e+00 1.83983126e+00 9.11080507e+01
1716.lowfreq: -8.1512 -2.5267 -0.0007 -0.0003 0.0003 3.1078 22.5274 28.1115 36.9472
frequency: 22.4635 27.9890 36.8291 55.4575 105.7470 108.6274 136.0819 154.8804 194.4536 209.3639 222.2297 244.4257 265.8216 288.3523 325.4416 356.0456 361.6283 363.8532 388.2197 428.6630 441.6228 476.8747 508.7550 524.7972 536.2902 552.7849 567.5470 610.1081 620.5238 652.8882 667.3624 715.9086 744.3382 749.4498 766.6494 781.6262 786.0981 803.2370 824.7968 850.5850 857.4368 873.3684 883.9046 912.1580 931.0320 939.9570 953.9224 959.2939 961.7216 1002.7230 1016.7300 1030.0352 1049.5892 1051.5657 1071.4864 1093.1713 1122.8422 1128.6209 1153.5406 1157.0979 1164.8233 1171.8947 1199.6210 1209.8636 1214.4116 1246.9930 1253.7949 1262.0170 1283.7433 1290.4651 1291.6324 1314.2161 1348.2445 1388.0286 1390.4054 1433.0245 1440.2176 1457.5690 1459.7196 1477.2422 1479.4786 1486.9126 1543.2518 1564.8632 1580.6442 1591.7439 1612.5493 1624.3765 1628.9670 2964.1780 2968.3605 2975.3272 3004.9623 3042.9014 3051.2047 3077.1615 3111.0132 3112.3218 3138.5536 3143.0821 3150.0646 3155.2817 3172.5187 3296.8879 3593.9751
redmass: 5.2321 4.7114 5.4938 5.2086 5.0767 5.7887 4.3480 2.5609 3.1679 6.1175 2.3043 3.6315 6.6204 3.4031 1.1958 6.3745 3.8766 5.8623 5.9390 2.9368 3.3908 5.2063 4.9429 3.7485 6.0210 4.6979 3.1115 5.7125 2.5252 6.3837 4.3215 2.6909 3.4740 2.9296 1.5739 4.8174 1.1435 5.6609 1.4083 2.2873 1.4354 3.1591 2.0149 2.3492 1.3921 1.4450 2.9213 1.3510 1.4959 1.3329 2.3465 3.4635 1.7001 3.0063 2.7084 2.7227 1.9293 1.4828 1.2471 1.6695 1.2801 1.0636 1.5751 2.9448 1.4129 2.6025 1.9263 1.2998 2.1118 1.4607 1.3678 1.4313 1.9262 3.7318 7.4824 2.4813 4.3794 1.1205 1.1596 2.3239 1.1208 2.5969 2.1015 5.3654 6.7516 5.3705 6.2014 7.2539 4.5793 1.0864 1.0659 1.0661 1.0642 1.0945 1.0945 1.1043 1.0873 1.0892 1.0961 1.0879 1.0927 1.0930 1.1003 1.0798 1.0662
irintensity: 3.3968 0.4302 2.4725 1.2245 2.1779 2.0562 0.0566 0.6663 0.1990 0.1466 11.0044 6.2064 20.2314 8.5185 137.0721 0.4221 5.9262 2.1753 17.8978 7.7261 0.9032 0.1446 3.8483 9.8789 7.8456 3.6639 2.9892 1.2354 1.9238 12.2573 16.4179 4.5626 2.8429 24.0546 52.0199 4.7378 121.5800 8.0108 14.7814 5.5993 0.1872 26.1517 16.0019 5.2030 7.7296 24.4282 8.2313 1.5805 26.8353 1.3235 0.5023 2.2627 12.3417 58.1626 52.5948 0.5807 116.1372 41.4001 23.9361 25.3734 15.1159 13.3963 1.3902 38.6251 1.9148 73.2600 154.0530 11.3976 4.7397 44.2417 13.9849 7.8765 5.4742 18.2677 8.6360 36.1223 8.1341 15.0379 7.3119 73.0217 13.8039 27.0111 350.7561 70.5107 28.1938 41.9474 44.5210 10.0015 159.7967 61.2422 41.1126 27.5241 44.0388 39.8637 31.4336 57.0784 13.3884 11.4832 32.2522 8.7956 0.4617 3.1905 32.1254 138.6235 40.9030
temp: 298.150 k
press: 1.00000 atm
elementType: 8 8 7 7 6 6 6 6 6 6 6 6 6 6 6 6 6 6 6 6 6 1 1 1 1 1 1 1 1 1 1 1 1 1 1 1 1
symmnumber: 1
zpe: 765595.2 jmol-1
zpe.correction: 0.291600 hartree
zpe.thermalcorrener: 0.309569 hartree
zpe.thermalcorrenthalpy: 0.310514 hartree
zpe.thermalcorrgfe: 0.243886 hartree
zpe.sumelectzpe: -915.865188 hartree
zpe.sumelectthermal: -915.847218 hartree
zpe.sumelectthermalent: -915.846274 hartree
zpe.sumelectthermalfe: -915.912901 hartree
dipole: 1.9581 5.5710 0.1313
dipole: 5.9065
quadrupole: -77.0820 -110.5279 -127.9904
quadrupole: 15.0458 1.0743 0.4878
quadrupole: 28.1181 -5.3278 -22.7903 15.0458 1.0743 0.4878
hfenergy: -916.1567878 hartree
pointgroup: C01 [X(C17H16N2O2)]
dipole: 0.7820719 -1.0483636 -1.9207835 debye
polarizability: 432.9131912|-5.571836|118.1514556|25.8839912|50.4531985|188.9283871 unknown
InChI: InChI=1S/C17H16N2O2/c20-16-7-2-1-6-15(16)17(21)19-18-11-12-8-9-13-4-3-5-14(13)10-12/h1-2,6-11,19-20H,3-5H2
charge 0 multiplicity 1
37 atoms
O  3.406512 -1.124702 -1.602076
O  1.980095 0.788225 1.956381
N  0.04735 -0.067546 0.123922
N  1.404848 -0.243139 -0.073721
C  -6.462128 1.175734 0.821261
C  -5.091784 0.976434 1.5429
C  -6.501565 0.070668 -0.2813
C  -4.215531 0.356329 0.460903
C  -5.028586 -0.164185 -0.58771
C  -2.819055 0.244856 0.410711
C  -4.435889 -0.800437 -1.695955
C  -2.208719 -0.392981 -0.711604
C  -3.027567 -0.909881 -1.754844
C  -0.752053 -0.527673 -0.819189
C  3.77852 -0.036058 0.556315
C  2.318466 0.211099 0.88473
C  4.306421 -0.660975 -0.608757
C  4.710509 0.413759 1.529041
C  5.698276 -0.826237 -0.790826
C  6.099359 0.256274 1.362851
C  6.59653 -0.367666 0.194713
H  -6.480147 2.171488 0.340312
H  -7.320787 1.119455 1.512743
H  -5.197224 0.274891 2.395565
H  -4.678972 1.916969 1.948761
H  -7.08813 0.370194 -1.168753
H  -6.963467 -0.858203 0.112976
H  -2.173449 0.637877 1.203205
H  -5.053191 -1.201758 -2.508093
H  -2.553622 -1.395176 -2.617905
H  -0.367158 -1.033921 -1.728923
H  1.783192 -0.70392 -0.921664
H  4.288512 0.89263 2.418991
H  6.079064 -1.311562 -1.6994
H  6.789005 0.614908 2.133161
H  7.673998 -0.49816 0.048235
H  3.886764 -1.53231 -2.363054
