program: Gaussian 09
title: 000276736
version: EM64L-G09RevD.01
frameworkgroup: C1[X(C10H13N5S)]
method: RPBEPBE
basis: SDD
operation: Freq
keyword: #p
keyword: freq=noraman
keyword: PBEPBE/SDD
title: #p freq=noraman PBEPBE/SDD
converged: NO YES NO NO
title: Mulliken charges:
elementType: S N N N N N C C C C C C C C C C H H H H H H H H H H H H H
charge: 0.266946 -0.024492 -0.207403 -0.039742 0.025268 0.002866 -0.417442 -0.417261 -0.445435 -0.458783 0.140101 -0.202479 0.126358 -0.370142 -0.391111 -0.824253 0.231697 0.259106 0.240573 0.250454 0.235078 0.227478 0.233991 0.235765 0.272239 0.246363 0.240906 0.281649 0.281706
chargesum: 0.00000
title: Mulliken charges with hydrogens summed into heavy atoms:
elementType: S N N N N N C C C C C C C C C C
charge: 0.266946 -0.024492 -0.207403 -0.039742 0.025268 0.002866 0.073361 0.073765 0.017122 0.010972 0.140101 0.069760 0.126358 -0.370142 -0.144748 -0.019992
polarizability: 2.45887426e+02 -7.34490074e-01 1.51604358e+02 2.10306558e+00 7.34824528e-02 9.16367373e+01
1716.lowfreq: -6.4445 -0.0012 -0.0004 0.0017 8.6653 12.3518 32.3330 47.6465 55.9125
frequency: 29.5518 47.5316 55.6076 76.8933 98.6073 105.4552 140.2247 151.0320 200.1190 231.5916 236.4604 265.0518 301.0577 401.1752 440.8275 521.2468 544.1730 548.5848 595.8957 619.6447 631.4293 653.2322 658.5379 670.1058 699.0586 782.0762 786.4253 805.9253 814.1425 834.2699 877.4834 883.2294 909.6544 921.3988 922.2859 950.1255 977.6051 990.3137 1035.4418 1056.9428 1102.2758 1118.5738 1129.1571 1157.4922 1174.9128 1181.3557 1205.9021 1216.4243 1253.3898 1273.2609 1283.7134 1292.2036 1294.1558 1306.4666 1311.1701 1326.5769 1343.6390 1356.2961 1394.0492 1428.9273 1433.4535 1449.1372 1461.8396 1468.4110 1476.2416 1489.6847 1512.2832 1542.0417 3006.8713 3014.5480 3016.8565 3024.7002 3026.6932 3063.1013 3083.6321 3101.9981 3109.9683 3151.7540 3158.6007 3168.3759 3229.8971
redmass: 3.8294 2.6029 3.0979 3.5766 2.2233 1.2298 4.2661 4.4999 5.6576 4.0647 5.2704 5.2714 2.6440 11.5505 3.6676 4.7795 4.7871 5.6142 5.4839 3.3142 5.7525 4.4388 6.7999 8.1874 3.5858 1.4813 2.6057 7.4309 2.2859 1.9244 5.5701 3.5556 3.1775 2.4672 1.4942 1.6103 1.1799 1.2939 2.7919 2.6235 5.2676 3.6995 4.0615 2.8265 1.3166 2.5989 1.2118 1.3003 1.4728 2.0176 3.6509 1.8218 1.4431 1.5385 2.3690 1.4273 1.1478 6.0699 1.5957 4.1351 1.0526 1.0552 1.0868 1.0897 1.0823 1.0956 9.4687 10.5644 1.0607 1.0656 1.0622 1.0676 1.0282 1.1015 1.1021 1.1030 1.1033 1.1042 1.1055 1.0921 1.0983
irintensity: 1.1660 0.1105 1.2722 2.0179 1.5086 0.4528 1.7166 1.1023 0.3581 0.7532 0.6583 0.1411 1.6686 4.6369 0.3997 22.4751 3.6914 6.6735 3.7012 1.6016 7.5340 11.8565 3.2378 3.4625 4.8182 16.0809 11.7634 27.6883 4.6094 2.2963 11.3248 8.0080 118.1558 10.7502 14.3842 6.9965 6.9027 5.8081 3.2724 8.3032 1.3211 8.8982 3.8155 55.9752 7.9748 17.5826 2.2385 5.1818 33.7597 32.3710 53.9101 18.5030 12.4694 26.3506 30.2139 7.5042 1.9064 8.3894 40.7623 7.6377 13.9843 28.6930 12.4581 1.5868 11.7544 21.9451 201.4388 83.6972 20.0822 26.8195 41.1791 37.0051 22.9749 8.6496 36.9930 22.5169 42.0687 8.3326 10.0787 16.4026 0.1268
temp: 298.150 k
press: 1.00000 atm
elementType: 16 7 7 7 7 7 6 6 6 6 6 6 6 6 6 6 1 1 1 1 1 1 1 1 1 1 1 1 1
symmnumber: 1
zpe: 595802.8 jmol-1
zpe.correction: 0.226929 hartree
zpe.thermalcorrener: 0.241606 hartree
zpe.thermalcorrenthalpy: 0.242550 hartree
zpe.thermalcorrgfe: 0.183304 hartree
zpe.sumelectzpe: -1059.452001 hartree
zpe.sumelectthermal: -1059.437324 hartree
zpe.sumelectthermalent: -1059.436380 hartree
zpe.sumelectthermalfe: -1059.495626 hartree
dipole: -3.8764 -0.3038 0.2128
dipole: 3.8941
quadrupole: -75.5607 -110.7453 -99.8485
quadrupole: 6.3829 -0.0214 1.0854
quadrupole: 19.8241 -15.3605 -4.4636 6.3829 -0.0214 1.0854
hfenergy: -1059.67893 hartree
pointgroup: C01 [X(C10H13N5S1)]
dipole: -1.5318526 0.0202166 -0.014107 debye
polarizability: 244.8953567|7.8386267|151.5040796|-8.0764663|6.0200848|92.7290844 unknown
InChI: InChI=1S/C10H13N5S/c1-16-10-8-9(11-6-12-10)15(7-13-8)14-4-2-3-5-14/h6-7H,2-5H2,1H3
charge 0 multiplicity 1
29 atoms
S  3.677647 1.593086 -0.13831
N  -2.289259 -0.816524 0.066882
N  -1.097213 -0.037597 0.036946
N  0.357272 1.744409 0.115462
N  0.555406 -1.882852 -0.257868
N  2.86074 -1.036011 -0.334012
C  -3.142612 -0.64862 -1.156117
C  -3.189351 -0.496524 1.224706
C  -4.1082 0.533743 -0.85097
C  -4.291274 0.494466 0.702721
C  0.188209 -0.582208 -0.103473
C  -0.92854 1.36028 0.159639
C  1.07273 0.543651 -0.056582
C  2.458094 0.256544 -0.181867
C  1.906616 -2.024513 -0.364165
C  5.25907 0.591761 -0.339283
H  -3.706772 -1.590752 -1.282321
H  -2.507031 -0.505897 -2.043359
H  -2.59396 -0.101486 2.062831
H  -3.64774 -1.446504 1.55161
H  -5.066619 0.429247 -1.387427
H  -3.655576 1.489986 -1.170192
H  -4.17711 1.500258 1.143979
H  -5.296428 0.130461 0.976803
H  -1.770712 2.034451 0.300573
H  2.280854 -3.044795 -0.488159
H  6.073699 1.332348 -0.325726
H  5.23481 0.046006 -1.292276
H  5.356252 -0.119916 0.491853
