program: Gaussian 09
title: 000276726
version: EM64L-G09RevD.01
frameworkgroup: C1[X(C13H17N5O5)]
method: RPBEPBE
basis: SDD
operation: Freq
keyword: #p
keyword: freq=noraman
keyword: PBEPBE/SDD
title: #p freq=noraman PBEPBE/SDD
converged: NO YES NO NO
title: Mulliken charges:
elementType: O O O O O N N N N N C C C C C C C C C C C C C H H H H H H H H H H H H H H H H H
charge: -0.295366 -0.276931 -0.228878 -0.421982 -0.217070 -0.197094 -0.429180 -0.036964 -0.060787 -0.622736 -0.136742 -0.073755 -0.166146 -0.184968 -0.371605 0.346067 -0.703774 -0.713083 0.398440 -0.215679 -0.145970 0.015862 0.147485 0.270546 0.231053 0.288279 0.299477 0.208701 0.243455 0.359764 0.216488 0.243359 0.245311 0.217482 0.221800 0.279994 0.264090 0.345687 0.304473 0.350898
chargesum: 0.00000
title: Mulliken charges with hydrogens summed into heavy atoms:
elementType: O O O O O N N N N N C C C C C C C C C C C C C
charge: -0.295366 -0.276931 -0.228878 -0.062218 -0.217070 -0.197094 -0.083493 -0.036964 -0.060787 0.032635 0.133804 0.157298 0.122132 0.114509 0.080552 0.346067 0.001383 0.006194 0.398440 0.048411 -0.145970 0.015862 0.147485
polarizability: 2.04985231e+02 2.32208345e+01 1.68366119e+02 1.03605128e+01 -2.34634491e+01 1.77967016e+02
1716.lowfreq: -11.1488 -4.1242 -0.0005 -0.0004 0.0004 8.2342 12.5390 30.5846 50.4259
frequency: 10.6548 30.5614 50.3685 69.7251 101.9678 111.3101 132.1315 143.2257 166.3725 185.0023 198.5942 220.0121 225.3384 235.4095 275.5641 284.2632 288.2057 296.4787 317.6203 324.6207 334.2170 339.7931 369.5273 383.5276 407.0356 432.9926 472.4625 478.3253 501.9992 521.8917 526.2172 534.3706 609.3664 613.0655 629.9052 642.1862 648.3614 650.7881 691.8626 705.5572 730.6208 740.9672 756.6418 761.7625 776.6092 786.0789 813.1591 835.0509 837.1308 902.3155 916.9953 924.1276 928.2538 935.6355 953.4151 977.3892 990.7329 1001.5709 1015.8596 1031.2522 1049.6321 1073.1276 1096.7426 1138.7720 1144.0133 1157.2057 1185.0665 1186.9950 1205.2374 1219.2686 1227.8055 1254.3521 1264.9432 1270.2314 1283.0027 1298.4534 1302.2373 1312.9981 1319.7699 1322.3506 1350.2038 1365.6571 1374.7135 1380.4385 1390.9485 1399.3858 1426.3343 1444.4395 1453.8834 1462.8949 1472.9672 1482.3024 1529.9715 1533.3779 1597.4580 1623.2630 1641.4234 2965.6954 2996.3783 2996.7407 3014.3045 3016.5721 3028.2741 3081.3677 3089.3809 3107.9524 3118.8126 3125.6279 3128.6794 3255.6845 3503.6638 3539.8414 3545.7832 3698.7204
redmass: 5.5237 6.7271 3.8982 5.8912 5.0805 6.0604 5.5290 1.9706 1.7739 6.8969 2.0063 4.6159 2.1067 2.9306 1.2205 3.2248 4.7428 5.2292 2.8960 2.9460 2.3257 2.0750 3.3586 2.3388 4.9648 3.2770 7.3508 4.3495 5.1873 4.4838 1.3542 3.4545 1.3947 2.5713 5.6488 5.1939 6.9507 7.1027 8.1227 5.1164 1.7196 4.5893 4.6829 4.8239 7.1294 6.0592 5.7162 3.8104 5.5090 3.8339 3.3580 2.4862 1.4440 6.4165 2.5996 2.1411 1.4704 3.2181 3.4679 4.7954 1.8971 4.0590 2.3130 3.2206 2.0197 2.9064 2.1841 2.4569 2.0100 1.4414 1.3092 1.7330 1.4174 2.4169 2.1368 1.7888 1.3791 1.7665 1.3915 2.1729 1.6519 1.2842 1.2600 1.2607 6.0652 1.2383 4.4207 1.0694 1.0524 1.0542 1.0631 1.0502 5.6640 3.7565 1.6196 8.8108 3.7981 1.0677 1.0384 1.0833 1.0363 1.0847 1.0877 1.0949 1.0985 1.1004 1.1001 1.1007 1.0883 1.0981 1.0784 1.0661 1.0452 1.1047
irintensity: 0.2680 5.4017 1.8782 2.6446 3.0035 2.8245 0.3819 2.6550 5.2827 5.7104 2.5768 2.0383 3.3506 4.5872 90.7459 11.8816 7.5223 2.9192 10.2661 11.1582 70.1110 21.8676 35.4422 4.9125 2.9705 5.3364 1.8185 8.2785 11.9281 3.7983 168.2954 62.8440 116.9595 5.3045 20.2588 0.5102 3.3084 2.8673 13.8066 13.8537 36.4546 15.3824 36.9203 47.7052 5.6125 19.1084 21.8144 17.2311 7.9189 63.9713 10.6049 26.6899 0.5417 29.2743 34.1015 35.0311 24.2341 118.0898 41.2758 49.1659 37.6893 51.1878 31.8582 23.0032 28.4251 33.8298 24.7999 106.4987 21.3961 90.1198 4.5082 2.5291 5.4771 14.1552 15.9399 20.2845 1.4364 25.0040 23.8347 90.7019 1.0361 7.2647 16.5415 30.4081 135.2246 29.4477 42.9523 13.0119 6.9929 5.8928 6.8898 6.7034 290.6282 160.3404 32.9767 583.3737 300.7136 32.2893 6.3214 31.1178 9.3004 63.8785 34.2187 17.6675 24.2432 3.8634 15.8634 9.5332 3.6270 0.2366 93.8903 15.3238 81.5886 40.4045
temp: 298.150 k
press: 1.00000 atm
elementType: 8 8 8 8 8 7 7 7 7 7 6 6 6 6 6 6 6 6 6 6 6 6 6 1 1 1 1 1 1 1 1 1 1 1 1 1 1 1 1 1
symmnumber: 1
zpe: 808865.7 jmol-1
zpe.correction: 0.308081 hartree
zpe.thermalcorrener: 0.329052 hartree
zpe.thermalcorrenthalpy: 0.329996 hartree
zpe.thermalcorrgfe: 0.258140 hartree
zpe.sumelectzpe: -1153.703675 hartree
zpe.sumelectthermal: -1153.682703 hartree
zpe.sumelectthermalent: -1153.681759 hartree
zpe.sumelectthermalfe: -1153.753615 hartree
dipole: -10.4706 -6.5684 7.3768
dipole: 14.3942
quadrupole: -156.9930 -129.2395 -130.3597
quadrupole: -24.8927 11.9816 -3.6220
quadrupole: -18.1289 9.6245 8.5044 -24.8927 11.9816 -3.6220
hfenergy: -1154.0117553 hartree
pointgroup: C01 [X(C13H17N5O5)]
dipole: 3.3336524 4.1138589 2.008464 debye
polarizability: 184.7571255|27.8014857|190.8032102|-22.4417828|14.9575614|175.7580301 unknown
InChI: InChI=1S/C13H17N5O5/c1-13(2)21-3-5-8(23-13)7(19)11(22-5)18-4-15-6-9(18)16-12(14)17-10(6)20/h4-5,7-8,11,16,19H,3,14H2,1-2H3
charge 0 multiplicity 1
40 atoms
O  0.652492 2.169652 0.149739
O  2.567676 -0.149848 -1.040898
O  1.92911 -0.524794 1.261756
O  2.132734 3.299354 -2.256478
O  -3.362394 -2.912562 -0.646831
N  -0.328254 0.584729 -1.394277
N  -1.760386 0.71469 0.651289
N  -1.152443 -1.376723 -2.244366
N  -3.331193 -1.11811 0.876232
N  -3.259442 0.590741 2.479635
C  2.693804 1.30082 -0.861137
C  2.088601 1.83542 0.464958
C  1.770027 1.92003 -1.945205
C  0.373224 1.869668 -1.276177
C  2.186926 0.862672 1.647919
C  2.796825 -0.995066 0.163008
C  4.287851 -0.975913 0.553756
C  2.272696 -2.375369 -0.211086
C  -1.315129 0.132989 -0.524267
C  -0.277689 -0.385649 -2.433796
C  -1.819033 -1.070716 -1.037827
C  -2.87284 -1.802723 -0.306464
C  -2.801282 0.015621 1.303743
H  3.739387 1.634929 -1.000876
H  2.567556 2.793969 0.747241
H  1.84397 1.373478 -2.894227
H  -0.270917 2.693161 -1.636383
H  3.186113 0.9705 2.119859
H  1.420719 1.103595 2.402855
H  1.936878 3.882876 -1.477804
H  4.678954 0.045602 0.705994
H  4.437662 -1.550743 1.483721
H  4.878828 -1.444366 -0.2506
H  2.820022 -2.765899 -1.084535
H  2.400731 -3.068505 0.636751
H  1.202159 -2.312393 -0.461935
H  0.422545 -0.314428 -3.260102
H  -1.205934 1.457603 1.086026
H  -3.06614 1.55642 2.732801
H  -3.996515 0.081385 2.961989
