program: Gaussian 09
title: 000276693
version: EM64L-G09RevD.01
frameworkgroup: C1[X(C8H8N4O)]
method: RPBEPBE
basis: SDD
operation: Freq
keyword: #pfreq=noraman
keyword: PBEPBE/SDD
title: #p freq=noraman PBEPBE/SDD
converged: NO NO NO YES
title: Mulliken charges:
elementType: O N N N N C C C C C C C C H H H H H H H H
charge: -0.247843 -0.243678 0.002653 -0.400576 -0.004032 -0.453710 -0.363073 -0.513949 0.194655 0.159380 0.048749 0.072078 -0.400371 0.243297 0.243321 0.260707 0.260711 0.260556 0.260581 0.279615 0.340930
chargesum: 0.00000
title: Mulliken charges with hydrogens summed into heavy atoms:
elementType: O N N N N C C C C C C C C
charge: -0.247843 -0.243678 0.002653 -0.059647 -0.004032 0.032907 0.158345 0.007188 0.194655 0.159380 0.048749 0.072078 -0.120755
polarizability: 1.57051322e+02 2.09114418e+00 1.20091560e+02 3.41780001e-04 2.59190847e-03 5.77541639e+01
1716.lowfreq: -108.7337 -12.0947 0.0007 0.0008 0.0008 8.4675 10.9246 102.9087 129.8715
frequency: -108.7329 102.8928 129.8695 172.5496 271.8720 274.8516 296.5568 335.0073 418.3865 482.9863 574.7592 589.0202 619.9212 662.0737 680.9561 700.7417 719.2736 753.5123 769.2099 773.1722 858.9543 864.5217 899.1650 918.8525 951.8170 1020.3771 1045.6457 1052.8384 1072.3313 1157.7872 1171.5304 1187.5377 1201.7877 1209.6843 1240.9973 1261.4423 1274.6637 1301.4256 1319.5507 1356.4009 1377.2461 1397.3839 1459.0442 1484.1977 1494.4423 1500.1847 1524.3538 1549.6058 1653.6830 3020.4030 3024.4899 3043.1502 3068.6107 3076.7830 3106.1557 3237.7867 3614.3445
redmass: 1.6364 4.9070 2.8989 6.6928 5.7069 4.7135 8.3658 5.8225 6.8343 6.0297 9.5123 4.4244 2.9425 1.3986 8.5825 8.0265 6.9792 7.2550 1.1471 4.3988 1.4901 7.6172 1.3833 3.5361 2.7689 5.6120 3.1857 6.5452 1.7095 7.5667 1.2353 1.8417 4.7370 1.1278 1.0766 1.3671 2.8928 1.8555 1.5903 3.4806 3.4312 3.5239 1.0885 1.1224 1.9521 1.7958 4.4495 9.3216 12.0347 1.0605 1.0590 1.0627 1.1042 1.1055 1.1052 1.0986 1.0824
irintensity: 0.6651 5.1258 0.0004 0.4492 0.0497 3.1384 3.3023 1.3174 3.2710 0.3352 0.7853 1.2304 19.7279 92.2536 8.1489 15.1701 8.7806 6.5556 7.3401 25.5243 19.5248 15.6451 1.2184 20.0500 8.4962 10.9989 7.0583 6.4330 0.0014 18.1931 0.5017 14.2073 55.9431 0.4365 0.0102 6.1937 34.2331 3.3118 4.1980 19.5816 5.9513 40.9634 13.4983 16.2565 0.8913 2.2274 13.1664 270.6049 443.1284 8.9125 15.0887 40.5783 2.4328 0.7304 32.8417 1.2624 92.8047
temp: 298.150 k
press: 1.00000 atm
elementType: 8 7 7 7 7 6 6 6 6 6 6 6 6 1 1 1 1 1 1 1 1
symmnumber: 1
zpe: 420647.6 jmol-1
zpe.correction: 0.160216 hartree
zpe.thermalcorrener: 0.169129 hartree
zpe.thermalcorrenthalpy: 0.170074 hartree
zpe.thermalcorrgfe: 0.125767 hartree
zpe.sumelectzpe: -602.966644 hartree
zpe.sumelectthermal: -602.957731 hartree
zpe.sumelectthermalent: -602.956786 hartree
zpe.sumelectthermalfe: -603.001093 hartree
dipole: 4.3104 -3.0402 0.0004
dipole: 5.2747
quadrupole: -68.0966 -81.4463 -74.2924
quadrupole: 1.4694 0.0017 0.0012
quadrupole: 6.5151 -6.8345 0.3194 1.4694 0.0017 0.0012
hfenergy: -603.12686 hartree
pointgroup: C01 [X(C8H8N4O1)]
dipole: -1.7095736 1.1759229 -0.0334706 debye
dipolederiv: -0.4863492 -0.1094633 -0.003403 -0.1052711 -1.2747536 -0.007196 -0.0033726 -0.0070255 -0.3638941 -0.6787128 0.3916599 -0.0107387 -0.1805694 -1.0526363 -0.0088917 -0.0138557 0.0042663 -0.1262234 -1.1692235 -0.0128365 -0.0219755 -0.1874362 -0.4947687 -0.0057199 -0.0227565 -0.0016654 -0.2212681 -0.3392555 0.0487649 -0.0020849 -0.2432217 -0.3407104 -0.0061106 -0.0034428 0.0006336 -0.2383282 -0.4827058 -0.2672856 -0.0075648 -0.0081854 0.0428812 0.0010244 -0.0063417 -0.004932 -0.2137354 0.0952464 -0.0045958 -0.0011833 0.0267105 -0.0492044 -0.0003758 -0.0008608 -0.0011039 0.1433784 0.4745095 0.117622 0.0050576 0.0836931 0.1859142 0.0014532 0.0049384 0.0021324 0.2789425 -0.1810234 0.0561523 -0.0064218 0.200091 -0.022339 0.0039055 -0.0055384 0.0005866 0.1094855 0.9209679 0.0433173 0.0196778 0.5108931 0.8066298 0.0156085 0.0219537 0.0048268 0.0767337 0.8944693 -0.0701991 0.0149346 0.0212223 1.7395147 0.0082485 0.0154008 0.0059761 0.236402 -0.398839 -0.3039648 -0.0097739 -0.1357436 -0.5653891 -0.0058139 -0.0089166 -0.0097199 -0.0428969 0.8073056 0.0317338 0.0167128 0.1491726 0.4292209 0.0052455 0.0172246 0.002487 0.0883015 0.2656747 -0.0315818 0.0077954 -0.1265327 0.0813223 -0.0021973 0.0072685 0.0000274 -0.0737293 -0.0375417 0.0011523 0.0871934 -0.0040709 0.0742689 0.0029234 0.1446363 0.0021196 -0.038006 -0.0264395 0.0021142 -0.086589 -0.0024849 0.0742335 -0.0018674 -0.1441442 -0.0008093 -0.0490836 -0.0006536 -0.0027106 -0.0013895 -0.0384027 0.012693 0.0701533 0.0393828 0.0886416 -0.0306668 0.0012081 0.0013554 0.0028682 -0.0348031 0.0142116 -0.0714075 -0.0382068 -0.0881726 -0.0337544 0.0222937 0.0114143 0.0111391 -0.0173124 0.0251536 -0.0763243 0.0389587 -0.1066 -0.0101429 0.0246508 0.0065218 -0.0094791 -0.0203598 0.0230588 0.0758541 -0.0376497 0.1073798 -0.0102479 0.0657167 0.0341429 -0.0022831 0.0455542 0.0425326 0.0004321 -0.0022242 0.000151 0.1708363 0.2287012 0.0566864 -0.0024923 0.0670573 0.2481667 0.0010558 -0.0024538 0.0008004 0.3478971 unknown
polarizability: 156.942706|2.5206053|120.1447306|2.3112077|0.3737705|57.80961 unknown
InChI: InChI=1S/C8H8N4O/c13-8-5-4-9-11-7(5)10-6-2-1-3-12(6)8/h4,11H,1-3H2
charge 0 multiplicity 1
21 atoms
O  -0.114095 -2.585495 -0.011954
N  -1.131412 -0.460266 -0.024824
N  0.021856 1.66171 0.012796
N  2.466284 1.336755 0.067687
N  3.400512 0.291838 0.084266
C  -3.435638 0.238203 -0.074825
C  -2.505888 -1.017264 -0.059185
C  -2.499417 1.487623 -0.046066
C  -1.092966 0.930017 -0.016655
C  0.027948 -1.328452 -0.002463
C  1.245815 -0.538386 0.029953
C  1.165264 0.885126 0.035247
C  2.642858 -0.842642 0.061135
H  -4.108777 0.23005 0.797427
H  -4.066456 0.239209 -0.978198
H  -2.658998 -1.662165 0.82263
H  -2.617988 -1.653935 -0.953074
H  -2.664947 2.125175 0.839588
H  -2.623889 2.13533 -0.931075
H  3.127235 -1.816447 0.067657
H  2.792096 2.301218 0.080033
