program: Gaussian 09
title: 000276696
version: EM64L-G09RevD.01
frameworkgroup: C1[X(C11H12N2O2)]
method: RPBEPBE
basis: SDD
operation: Freq
keyword: #p
keyword: freq=noraman
keyword: PBEPBE/SDD
title: #p freq=noraman PBEPBE/SDD
converged: YES YES NO NO
title: Mulliken charges:
elementType: O O N N C C C C C C C C C C C H H H H H H H H H H H H
charge: -0.229447 -0.428183 -0.395681 -0.034415 -0.362630 -0.423326 0.080848 0.172710 0.363447 -0.332249 -0.388064 -0.369599 -0.245376 -0.228681 -0.235398 0.264830 0.245941 0.224531 0.276541 0.173317 0.340065 0.234820 0.269542 0.230251 0.232271 0.234100 0.329836
chargesum: 0.00000
title: Mulliken charges with hydrogens summed into heavy atoms:
elementType: O O N N C C C C C C C C C C C
charge: -0.229447 -0.098347 -0.055616 -0.034415 -0.097800 0.047146 0.080848 0.172710 0.363447 0.117609 -0.153244 -0.100057 -0.015125 0.003590 -0.001298
polarizability: 2.05353048e+02 2.53769370e+01 1.43286066e+02 -9.98084888e+00 1.68785303e+01 8.29475587e+01
1716.lowfreq: -7.4625 -6.1122 -0.0005 -0.0004 0.0001 11.5241 44.4864 50.7524 79.8335
frequency: 44.3449 50.7438 79.8295 93.5094 103.5393 143.0811 180.9233 225.4558 254.5650 313.6720 326.5813 339.9740 366.9654 402.7891 407.1067 492.4696 524.8933 613.3307 617.1702 627.4390 650.6868 690.7160 697.7083 732.0826 773.8670 777.8573 850.9804 852.8142 871.2620 928.1926 966.2800 981.0551 987.4427 1002.1778 1009.2396 1024.9327 1035.6097 1041.8248 1045.4677 1074.7218 1091.9382 1126.0548 1174.3652 1185.6638 1189.7150 1212.5488 1236.3765 1289.2501 1295.1758 1310.7188 1329.9986 1337.8647 1375.2762 1381.9269 1382.4476 1435.4626 1465.7536 1482.7911 1485.3311 1518.4686 1584.0733 1613.1100 1660.6939 2941.8717 2988.9187 3000.4090 3056.7521 3108.2938 3124.5361 3133.7964 3145.9914 3159.0287 3170.5065 3552.0772 3602.2463
redmass: 4.0070 6.6088 5.1076 2.2145 4.3635 4.7564 4.2188 4.0092 3.8366 5.5102 1.2507 5.7094 5.1526 2.8444 6.3290 3.7162 4.4629 4.4131 1.7650 2.3713 5.8719 4.2173 1.7525 6.9512 1.7669 1.6554 1.6443 1.7669 3.7354 1.4451 4.2420 1.3880 5.9070 1.3461 3.7243 1.9425 2.9568 2.6822 3.1281 2.2571 1.8078 1.2669 1.0700 2.2218 1.1446 2.0534 1.5770 1.2301 1.2629 1.6084 1.6948 1.2803 2.1484 1.2850 5.3185 2.4210 1.0835 2.7128 1.0986 5.5932 6.0808 6.0007 9.1240 1.0710 1.0620 1.0823 1.0991 1.0947 1.0859 1.0876 1.0927 1.0959 1.1007 1.0663 1.0814
irintensity: 0.3445 0.5557 2.4682 4.8515 0.9753 0.6270 6.5958 5.4883 2.3595 7.6299 136.1415 6.1585 10.8368 0.0455 8.9830 12.6301 7.0144 14.2890 64.3390 67.3010 22.5981 12.8104 55.5030 12.1733 36.2841 42.0686 10.3411 7.8508 6.8350 2.8901 90.9724 0.9443 1.5595 1.1305 43.2876 3.8880 22.2461 30.8972 30.5065 17.0279 18.1573 18.9610 0.9063 35.9274 0.2111 45.7568 62.4951 0.9875 10.2308 12.8031 41.8751 16.1646 1.5284 10.4719 0.5671 11.9339 1.5257 9.5627 6.4518 3.6598 1.6162 0.1703 441.0199 65.4675 18.1930 5.7823 14.3143 6.3790 7.8187 1.3587 25.5965 18.9948 18.0804 7.5448 70.4901
temp: 298.150 k
press: 1.00000 atm
elementType: 8 8 7 7 6 6 6 6 6 6 6 6 6 6 6 1 1 1 1 1 1 1 1 1 1 1 1
symmnumber: 1
zpe: 558373.4 jmol-1
zpe.correction: 0.212673 hartree
zpe.thermalcorrener: 0.226152 hartree
zpe.thermalcorrenthalpy: 0.227096 hartree
zpe.thermalcorrgfe: 0.171551 hartree
zpe.sumelectzpe: -685.206439 hartree
zpe.sumelectthermal: -685.192960 hartree
zpe.sumelectthermalent: -685.192016 hartree
zpe.sumelectthermalfe: -685.247561 hartree
dipole: 4.6072 1.0806 0.4959
dipole: 4.7581
quadrupole: -102.7739 -80.2132 -88.7972
quadrupole: 6.8662 -2.0936 6.9786
quadrupole: -12.1791 10.3815 1.7976 6.8662 -2.0936 6.9786
hfenergy: -685.419112 hartree
pointgroup: C01 [X(C11H12N2O2)]
dipole: -1.8338736 0.3067057 -0.2173075 debye
polarizability: 207.9824984|-22.4000674|137.605331|-7.4552211|-21.6288709|85.998843 unknown
InChI: InChI=1S/C11H12N2O2/c14-7-6-9-10(12-13-11(9)15)8-4-2-1-3-5-8/h1-5,9,13-14H,6-7H2
charge 0 multiplicity 1
27 atoms
O  3.54837 -1.174911 -0.446181
O  3.064102 3.142714 0.602121
N  1.60665 -2.271924 0.366197
N  0.216853 -2.061569 0.501946
C  1.234866 -0.118523 -0.425812
C  1.565485 1.169264 0.391736
C  -0.031663 -0.834486 0.034266
C  2.313293 -1.207958 -0.208351
C  -1.396918 -0.293141 -0.00165
C  2.752242 1.954803 -0.204145
C  -1.699192 0.869663 -0.764782
C  -2.44733 -0.934101 0.716852
C  -3.014514 1.379167 -0.805828
C  -3.757595 -0.422417 0.673487
C  -4.048428 0.738173 -0.086013
H  1.192028 0.139085 -1.502841
H  1.800393 0.900963 1.438189
H  0.664718 1.814127 0.418842
H  3.670012 1.348125 -0.187924
H  2.535244 2.233018 -1.259761
H  1.996982 -3.164979 0.662948
H  -0.913111 1.3641 -1.347297
H  -2.213219 -1.828595 1.302555
H  -3.2342 2.271069 -1.402818
H  -4.555378 -0.923548 1.232634
H  -5.06886 1.135412 -0.116589
H  2.282971 3.752666 0.599822
