program: Gaussian 09
title: 000276749
version: EM64L-G09RevD.01
frameworkgroup: C1[X(C14H13N9)]
method: RPBEPBE
basis: SDD
operation: Freq
keyword: #pfreq=noraman
keyword: PBEPBE/SDD
title: #p freq=noraman PBEPBE/SDD
converged: YES YES NO NO
title: Mulliken charges:
elementType: N N N N N N N N N C C C C C C C C C C C C C C H H H H H H H H H H H H H
charge: -0.168330 -0.010778 -0.256701 -0.029097 -0.196787 -0.048219 -0.162184 -0.606707 -0.600345 -0.555981 0.128543 -0.095979 0.282590 0.503387 -0.215587 -0.442485 -0.356874 0.215371 -0.358479 -0.215292 -0.224040 0.055379 -0.238403 0.268873 0.238504 0.276203 0.232454 0.245813 0.246454 0.229859 0.230718 0.232504 0.404713 0.326578 0.331563 0.332762
chargesum: 0.00000
title: Mulliken charges with hydrogens summed into heavy atoms:
elementType: N N N N N N N N N C C C C C C C C C C C C C C
charge: -0.168330 -0.010778 -0.256701 -0.029097 -0.196787 -0.048219 -0.162184 0.124584 0.063980 -0.048603 0.128543 -0.095979 0.282590 0.503387 0.060616 -0.210031 -0.111061 0.215371 -0.112025 0.014567 0.006678 0.055379 -0.005899
polarizability: 3.48732188e+02 8.31130138e-01 2.08517078e+02 -2.58365987e+01 9.29521000e+00 1.41008829e+02
1716.lowfreq: -8.6121 -5.9160 -4.4904 -0.0007 -0.0004 -0.0003 7.1383 15.1370 26.2599
frequency: -6.8297 15.0073 26.2537 51.5191 71.9813 105.1071 134.4392 175.9166 191.8265 213.1102 217.6328 257.3468 266.4354 295.4548 310.0116 342.5266 355.3889 360.5916 374.6577 402.7482 443.0118 460.7552 481.5603 485.6803 533.4042 553.6738 575.7447 609.1526 615.9556 634.7399 644.1239 651.5498 655.1263 670.5655 702.6506 718.4865 723.5879 767.9724 772.5740 779.4390 794.4852 810.8032 829.8156 833.3492 854.8185 893.7542 914.4934 920.7169 954.6979 965.7965 979.2719 990.8448 999.7664 1000.9118 1026.1467 1044.5962 1083.3195 1096.8700 1110.0518 1136.5402 1146.3200 1174.0858 1188.8328 1194.9077 1217.8298 1243.4123 1291.1805 1299.1327 1323.1599 1324.8817 1336.3723 1368.9289 1373.0016 1386.7312 1388.1798 1399.5220 1419.6612 1443.0282 1457.9363 1475.8672 1487.4660 1515.0728 1535.5799 1556.4197 1571.6839 1597.2652 1616.0862 1617.6839 1659.0241 3002.5912 3057.7459 3117.5558 3125.6472 3137.2382 3149.2383 3166.3092 3167.6297 3231.7840 3294.7078 3581.6896 3652.9348 3734.8451
redmass: 4.0830 4.9028 6.2406 6.1628 7.0005 5.3712 6.9487 5.4046 5.8288 5.3657 6.0390 5.0499 4.5114 3.8676 5.3814 2.5887 2.1395 5.4844 1.6019 2.7969 1.1870 3.2700 3.9320 1.2343 5.4702 3.7414 6.5858 5.4983 6.5215 6.3901 6.1325 6.3458 6.2389 10.3829 2.3323 7.7994 2.1005 4.2513 1.4103 4.0115 3.0240 3.4696 9.0735 1.7124 1.2489 6.6152 1.4242 1.4181 4.0408 1.9534 1.3915 6.1797 1.3309 3.1695 2.2680 3.9607 1.9212 2.5900 3.1840 4.5401 2.8801 1.0544 1.1305 2.3511 2.5729 1.8522 4.0802 2.2095 5.9146 2.5714 1.5403 3.5476 1.7325 3.4242 4.7939 3.1803 3.1799 2.2033 2.3815 1.5611 1.9429 1.5760 3.7134 1.9301 11.3180 6.1032 5.8116 2.3931 6.4925 1.0591 1.1040 1.0878 1.0867 1.0911 1.0960 1.1015 1.0924 1.0984 1.0618 1.0443 1.0903 1.1057
irintensity: 0.0147 0.0810 0.4621 0.7974 2.6932 1.0504 1.7519 1.7880 7.8076 5.3968 0.8850 2.6194 3.7835 7.8955 6.9062 1.7010 110.8641 11.0053 129.2924 0.4328 73.3255 6.7325 3.8808 201.0031 5.6213 1.7972 10.9680 1.9474 0.2238 1.4720 1.6009 26.8066 12.6545 0.7524 20.5574 2.4021 106.6082 37.5247 71.1072 16.9547 58.0062 12.8782 8.9558 6.2817 0.0512 10.5045 0.3286 10.7249 4.5378 15.3920 0.0975 0.7413 0.8966 0.9663 5.7568 42.0988 14.1691 1.4121 12.3299 30.9770 14.8266 0.0769 8.1039 46.3082 18.7865 47.1118 40.9983 33.8115 9.9230 199.0127 85.6462 91.1203 13.1596 28.6170 0.5985 186.6521 60.3720 16.9454 30.7533 34.8029 28.4302 179.5096 74.7015 221.7172 781.2568 1.4545 23.3690 783.2391 214.0595 32.0645 7.3911 8.3314 3.3814 10.5425 35.9115 23.4205 17.4761 0.0935 159.2105 167.5196 126.8434 51.8982
temp: 298.150 k
press: 1.00000 atm
elementType: 7 7 7 7 7 7 7 7 7 6 6 6 6 6 6 6 6 6 6 6 6 6 6 1 1 1 1 1 1 1 1 1 1 1 1 1
symmnumber: 1
zpe: 711287.2 jmol-1
zpe.correction: 0.270915 hartree
zpe.thermalcorrener: 0.288582 hartree
zpe.thermalcorrenthalpy: 0.289526 hartree
zpe.thermalcorrgfe: 0.223757 hartree
zpe.sumelectzpe: -1032.453607 hartree
zpe.sumelectthermal: -1032.435940 hartree
zpe.sumelectthermalent: -1032.434996 hartree
zpe.sumelectthermalfe: -1032.500765 hartree
dipole: 2.5304 0.3569 -0.0668
dipole: 2.5564
quadrupole: -109.7065 -122.6854 -127.3944
quadrupole: -5.9201 -5.0113 2.3812
quadrupole: 10.2222 -2.7566 -7.4657 -5.9201 -5.0113 2.3812
hfenergy: -1032.7245216 hartree
pointgroup: C01 [X(C14H13N9)]
dipole: -1.0007087 -0.0748197 -0.0672354 debye
polarizability: 347.7362007|-14.3876678|208.4663217|24.9873537|11.5117328|142.0555733 unknown
InChI: InChI=1S/C14H13N9/c15-13-20-14(16)23(21-13)12-10-11(17-7-18-12)22(8-19-10)6-9-4-2-1-3-5-9/h1-5,7-8H,6,15-16H2
charge 0 multiplicity 1
36 atoms
N  -1.485652 0.243509 -0.984326
N  0.361073 1.459549 -0.346803
N  3.130125 -0.14064 0.088166
N  -0.511114 -2.015237 -1.073061
N  1.858975 -2.029029 -0.49516
N  3.321468 1.259145 0.335417
N  5.319185 0.049314 0.648834
N  4.485005 -2.172176 0.126846
N  5.306707 2.437294 0.988388
C  -2.86997 -0.088408 -1.381016
C  -0.441574 -0.670251 -0.861651
C  0.706627 0.097027 -0.466825
C  1.90242 -0.663468 -0.28633
C  -3.897715 0.220683 -0.297721
C  -0.945267 1.498021 -0.660134
C  -5.040805 0.999585 -0.597518
C  -3.735435 -0.293287 1.014025
C  4.362661 -0.827953 0.289909
C  0.687421 -2.6233 -0.867481
C  -6.013058 1.259803 0.396145
C  -4.702687 -0.031869 2.00748
C  4.641601 1.282557 0.66057
C  -5.845653 0.745081 1.701174
H  -2.85512 -1.169724 -1.613573
H  -3.118072 0.453734 -2.311726
H  -1.5523 2.401001 -0.660016
H  -5.1736 1.403764 -1.60907
H  -2.852169 -0.897146 1.254167
H  0.72221 -3.706238 -1.014545
H  -6.893952 1.864298 0.153151
H  -4.568442 -0.432752 3.018252
H  -6.596132 0.94781 2.473187
H  3.625377 -2.672783 -0.155376
H  5.391791 -2.602751 0.284956
H  4.810725 3.322915 0.996093
H  6.292649 2.386817 1.22217
