program: Gaussian 09
title: 000276852
version: EM64L-G09RevD.01
frameworkgroup: C1[X(C28H17BrO8)]
method: RPBEPBE
basis: SDD
operation: Freq
keyword: #p
keyword: freq=noraman
keyword: PBEPBE/SDD
title: #p freq=noraman PBEPBE/SDD
converged: YES YES NO NO
title: Mulliken charges:
elementType: Br O O O O O O O O C C C C C C C C C C C C C C C C C C C C C C C C C C C C H H H H H H H H H H H H H H H H H
charge: 0.025363 -0.392264 -0.418229 -0.151706 -0.135528 -0.286742 -0.134198 -0.127489 -0.420306 -0.414821 0.200462 0.223932 0.370927 0.025129 0.055844 -0.176513 -0.157162 0.349184 0.445977 0.295925 0.246967 -0.494763 -0.380553 -0.227207 -0.223428 0.239944 -0.387212 -0.372448 -0.403304 -0.376048 -0.369697 0.281186 -0.225240 -0.259263 -0.236183 -0.233344 -0.517028 0.317935 0.280921 0.267868 0.292454 0.194107 0.292815 0.296884 0.397594 0.366463 0.238801 0.242871 0.241904 0.248797 0.359050 0.220378 0.232811 0.268185
chargesum: 0.00000
title: Mulliken charges with hydrogens summed into heavy atoms:
elementType: Br O O O O O O O O C C C C C C C C C C C C C C C C C C C C C C C C C C C C
charge: 0.025363 0.005330 -0.051765 -0.151706 -0.135528 -0.286742 -0.134198 -0.127489 -0.061256 -0.096886 0.200462 0.223932 0.370927 0.025129 0.055844 -0.176513 -0.157162 0.349184 0.445977 0.295925 0.246967 -0.213842 -0.112685 -0.227207 -0.223428 0.239944 -0.094758 -0.178341 -0.403304 -0.083233 -0.072813 0.281186 0.013561 -0.016393 0.005721 0.015453 0.204346
polarizability: 4.09089837e+02 -3.67063840e+01 3.85509035e+02 -4.04764004e-01 -8.53283830e+00 3.30910247e+02
1716.lowfreq: -4.1910 -3.6502 -0.6668 -0.0006 -0.0004 0.0004 8.7621 16.8519 22.9320
frequency: 8.1545 16.8054 22.9302 25.0276 27.7294 40.2962 54.7602 55.3468 59.2747 83.1704 87.2177 94.9628 102.8338 117.6234 130.0259 136.2489 153.1289 163.0783 172.2902 182.3529 183.8696 189.2414 232.6196 253.0827 273.3695 275.8015 279.7245 290.7554 305.5837 334.3214 338.4177 353.6316 358.8917 363.1707 365.4992 366.6713 393.4128 405.2660 409.1586 415.0065 435.9282 439.4777 443.5861 448.5784 467.0310 470.4487 502.1934 511.2042 524.9878 536.4873 554.8435 566.0124 579.8835 592.1161 608.8631 632.0276 637.1563 653.8671 663.4123 676.3883 684.9062 707.4230 718.2826 728.7662 728.9896 742.1876 765.3077 771.4134 778.3674 791.3533 845.6781 847.0152 853.7745 858.5177 866.9017 885.7711 891.7120 902.6020 926.5673 933.5681 945.9412 972.9789 973.8746 990.1729 1007.7343 1010.0008 1010.2368 1021.0610 1040.2394 1042.1115 1080.4484 1087.6107 1091.1972 1112.6113 1125.7513 1152.9869 1155.2396 1163.6807 1174.4768 1180.3857 1202.4263 1211.0799 1215.1056 1218.8794 1220.9342 1248.4109 1250.8698 1263.4312 1275.9357 1281.0433 1284.8041 1301.9617 1310.0329 1362.4426 1387.0027 1391.1438 1394.5449 1397.4057 1403.9247 1437.6424 1438.8438 1440.4956 1454.4876 1465.0429 1477.8758 1482.1597 1483.6067 1524.7113 1542.9158 1562.6582 1570.5376 1572.9055 1579.0404 1585.0368 1600.5995 1603.7230 1615.2688 1616.3079 1634.3419 2964.9844 2986.8926 3095.1444 3098.8755 3138.0013 3138.3763 3146.0177 3151.8792 3157.1784 3162.9729 3166.5928 3171.8025 3174.1366 3182.4302 3399.5942 3462.2298 3579.3689
redmass: 9.3957 6.8503 7.0537 6.4420 8.8619 5.5919 2.8523 5.5536 8.8259 6.9461 4.8986 4.7481 4.9010 10.0381 4.7296 1.6610 6.7950 7.1209 6.6412 6.0427 5.8713 6.3087 3.8357 1.5556 5.9923 6.7405 7.0310 5.9633 5.2849 6.5433 6.3384 7.1376 7.0882 11.0193 7.1255 8.4293 8.4430 7.0893 4.6350 5.0844 3.8160 1.1424 5.4316 3.9540 7.6042 7.5019 7.0343 6.1762 5.5913 3.9744 1.5783 4.8739 4.5878 5.3119 6.2928 5.3169 6.4497 5.8158 5.8711 5.5312 5.7387 5.5434 4.1948 3.9500 4.3948 5.4008 5.2451 1.6881 6.2568 1.5014 2.4225 6.5465 3.1610 2.4506 3.1403 1.6840 2.3342 2.8694 2.0789 4.8483 5.7342 1.4098 8.0921 1.4007 5.5270 1.3976 1.3674 3.7549 2.0545 2.2241 2.9916 2.9640 2.5201 1.2378 2.0648 2.2836 1.3911 2.0263 1.1143 1.1476 1.6564 1.7672 2.2144 2.7004 1.9362 2.2698 1.8958 2.9991 2.2008 2.1258 1.9950 2.6478 2.3014 2.1748 5.1007 9.2369 5.3835 3.0106 2.0601 2.2336 2.1683 1.4901 1.2836 2.5475 1.0602 2.6079 2.8580 12.4472 12.8173 6.5802 8.7547 8.0335 7.9777 6.9917 7.6326 7.4129 8.0574 8.2130 7.3502 1.0803 1.0339 1.0890 1.0981 1.0864 1.1055 1.0877 1.0912 1.0932 1.0925 1.0975 1.0908 1.1004 1.0963 1.0658 1.0647 1.0657
irintensity: 0.1278 1.1132 0.4053 0.3740 3.6393 4.7898 2.9684 0.6437 1.2033 1.7420 0.5255 2.4951 2.9475 1.3568 0.8239 2.6082 1.8812 5.4774 1.2587 1.9132 0.7019 2.6973 1.9670 63.7443 4.2280 5.5918 3.4789 11.1150 3.2004 8.8181 2.3778 6.9437 11.8145 0.5723 10.1447 2.0103 0.3977 5.5642 0.5406 1.3987 33.6610 108.6437 14.4900 14.5293 1.8805 7.4374 5.6425 1.0412 5.6614 24.5572 96.7246 21.4162 1.9486 17.8894 8.5896 3.8176 7.4378 6.4424 13.4186 39.5837 27.2147 41.4407 3.6553 14.6020 10.0391 6.3652 33.5893 60.0184 11.4089 55.8896 2.6234 32.3252 27.8645 4.1366 3.6751 3.6310 1.6896 17.1165 0.6631 1.0095 13.6682 1.8663 51.1794 3.7397 10.8699 0.6914 0.0271 45.3117 0.3793 8.5129 12.2671 16.5454 24.0671 6.1818 28.8841 67.6668 9.4064 89.1237 0.6569 14.3848 30.1152 100.7142 32.3834 59.6186 15.8144 328.8036 17.8361 54.5584 10.7212 33.4582 57.5619 105.4988 9.3503 48.3841 2.9342 2.0092 42.3519 54.1881 31.4187 11.5447 11.5807 14.8031 80.0084 131.5028 21.6512 21.9991 41.1125 209.4659 283.8564 71.3978 5.1916 5.8432 127.3366 37.2377 13.3817 33.9008 17.3163 9.6723 23.4001 24.6449 78.9391 20.9543 30.8419 3.6295 10.4136 3.6282 5.9603 2.7045 0.0951 21.3494 1.5538 21.3620 7.6920 513.7655 79.7278 38.0171
temp: 298.150 k
press: 1.00000 atm
elementType: 35 8 8 8 8 8 8 8 8 6 6 6 6 6 6 6 6 6 6 6 6 6 6 6 6 6 6 6 6 6 6 6 6 6 6 6 6 1 1 1 1 1 1 1 1 1 1 1 1 1 1 1 1 1
symmnumber: 1
zpe: 993613.2 jmol-1
zpe.correction: 0.378447 hartree
zpe.thermalcorrener: 0.411073 hartree
zpe.thermalcorrenthalpy: 0.412017 hartree
zpe.thermalcorrgfe: 0.310132 hartree
zpe.sumelectzpe: -1689.833453 hartree
zpe.sumelectthermal: -1689.800828 hartree
zpe.sumelectthermalent: -1689.799883 hartree
zpe.sumelectthermalfe: -1689.901769 hartree
dipole: -0.3303 -0.8094 -11.0406
dipole: 11.0752
quadrupole: -186.0129 -203.5639 -238.6253
quadrupole: -7.7026 -32.3667 -4.9260
quadrupole: 23.3878 5.8368 -29.2246 -7.7026 -32.3667 -4.9260
hfenergy: -1690.2119006 hartree
pointgroup: C01 [X(C28H17Br1O8)]
dipole: -0.0235874 0.2112855 4.3521233 debye
polarizability: 427.0995229|-24.6725024|368.148101|-2.4981372|-5.671772|330.261496 unknown
InChI: InChI=1S/C28H17BrO8/c1-37-18-11-12(10-17(29)26(18)34)19(20-22(30)13-6-2-4-8-15(13)24(32)27(20)35)21-23(31)14-7-3-5-9-16(14)25(33)28(21)36/h2-11,19,30-31,34H,1H3
charge 0 multiplicity 1
54 atoms
Br -2.477706 5.216305 -1.126674
O  -1.955286 0.468446 1.539463
O  0.591875 -0.957417 1.609258
O  -0.732772 -1.78812 -2.556919
O  2.127755 0.356399 -2.694166
O  1.575721 3.912132 2.205014
O  -3.046392 -3.347961 -2.333978
O  4.430588 -1.2185 -2.405635
O  -0.373674 5.76671 1.152441
C  -0.051034 0.33427 -0.86463
C  -1.28973 -0.533489 -0.591643
C  1.261189 -0.395616 -0.584033
C  -0.123159 1.763476 -0.29491
C  -2.147555 -0.416248 0.498779
C  1.541546 -1.065222 0.592072
C  -1.533582 -1.581981 -1.590793
C  2.27582 -0.349243 -1.653636
C  -3.365961 -1.234993 0.670108
C  2.77268 -1.851023 0.830021
C  -3.691812 -2.237915 -0.289429
C  3.761806 -1.921461 -0.197314
C  0.754297 2.247226 0.703504
C  -1.07766 2.656545 -0.850727
C  -2.801331 -2.469874 -1.461754
C  3.57397 -1.182299 -1.482349
C  0.69579 3.581469 1.170087
C  -4.221969 -1.033938 1.780876
C  3.005849 -2.546855 2.043856
C  -1.140456 3.973997 -0.377328
C  -4.859847 -3.020496 -0.129301
C  4.939023 -2.679645 -0.003973
C  -0.284072 4.471762 0.63833
C  -5.386639 -1.818532 1.931217
C  4.182994 -3.304802 2.228895
C  -5.709498 -2.813737 0.977248
C  5.154094 -3.375412 1.20363
C  2.300946 5.203052 2.142603
H  -0.031774 0.454123 -1.968633
H  1.531503 1.609349 1.13249
H  -1.750186 2.319488 -1.644616
H  -3.967911 -0.262207 2.511474
H  2.287251 -2.521555 2.874173
H  -5.077858 -3.782034 -0.885142
H  5.670428 -2.705156 -0.818332
H  -1.110845 0.987328 1.419826
H  0.788273 -1.532077 2.389295
H  -6.043713 -1.652778 2.791708
H  4.340794 -3.837505 3.172224
H  -6.614014 -3.418793 1.097772
H  6.065315 -3.963869 1.348612
H  -1.104699 6.262294 0.69225
H  2.887825 5.265036 1.206926
H  2.97712 5.180194 3.010033
H  1.60388 6.052152 2.208932
