program: Gaussian 09
title: 000276830
version: EM64L-G09RevD.01
frameworkgroup: C1[X(C22H12N6O12)]
method: RPBEPBE
basis: SDD
operation: Freq
keyword: #p
keyword: freq=noraman
keyword: PBEPBE/SDD
title: #p freq=noraman PBEPBE/SDD
converged: YES YES NO NO
title: Mulliken charges:
elementType: O O O O O O O O O O O O N N N N N N C C C C C C C C C C C C C C C C C C C C C C H H H H H H H H H H H H
charge: -0.208059 -0.179581 -0.177104 -0.208350 -0.154068 -0.144487 -0.137240 -0.157660 -0.166774 -0.181382 -0.184083 -0.165220 0.018988 0.023453 0.003067 0.013396 0.029406 0.026037 0.405453 0.428803 -0.536945 0.226569 0.216838 -0.613762 -0.271448 -0.278220 0.396589 0.384775 -0.280280 -0.282532 0.129971 0.110998 0.259892 0.273963 -0.382036 -0.381168 -0.363531 -0.361553 -0.218944 -0.219381 0.266413 0.334962 0.263622 0.266951 0.258900 0.265977 0.267797 0.273487 0.299970 0.297530 0.254613 0.255388
chargesum: 0.00000
title: Mulliken charges with hydrogens summed into heavy atoms:
elementType: O O O O O O O O O O O O N N N N N N C C C C C C C C C C C C C C C C C C C C C C
charge: -0.208059 -0.179581 -0.177104 -0.208350 -0.154068 -0.144487 -0.137240 -0.157660 -0.166774 -0.181382 -0.184083 -0.165220 0.018988 0.023453 0.003067 0.013396 0.029406 0.026037 0.405453 0.428803 -0.270532 0.226569 0.216838 -0.278800 -0.007826 -0.011269 0.396589 0.384775 -0.021380 -0.016555 0.129971 0.110998 0.259892 0.273963 -0.114238 -0.107681 -0.063561 -0.064023 0.035669 0.036006
polarizability: 6.11146481e+02 5.48853504e-01 5.58255019e+02 -1.44445603e+01 -2.52012377e-01 1.55955052e+02
1716.lowfreq: -5.1879 -3.3936 -0.0002 0.0009 0.0011 0.6936 7.2513 9.6384 15.9231
frequency: 6.9574 9.5940 15.9070 19.6240 22.2762 24.7756 27.2158 32.1532 38.5247 41.0188 43.9265 63.3201 71.6379 87.7355 99.1543 103.6345 109.1778 118.2775 140.2825 154.1276 170.7223 172.8706 174.2170 177.3175 180.0532 193.3337 195.6680 231.8371 237.1979 281.7173 284.6865 295.0678 314.0931 320.0852 322.9798 351.1796 355.6485 367.6415 371.3426 388.2099 389.9980 398.5765 441.6866 455.0670 455.9723 493.5323 500.8244 508.9416 536.4077 542.9624 564.3938 570.9437 585.7619 592.5052 608.3730 641.5214 648.7633 657.1422 667.9853 668.9362 670.7188 674.2465 686.8248 687.6032 697.7509 721.2184 729.1382 736.6827 742.2436 748.0106 756.0044 759.3658 791.0893 793.7569 803.3017 814.7603 820.2523 840.3483 862.2497 872.2700 901.2776 920.2920 933.0360 941.0900 943.1046 963.4123 966.6322 973.5552 999.9518 1001.5310 1030.7738 1050.7913 1051.6848 1088.9914 1112.9653 1113.9005 1156.3469 1160.4476 1167.8413 1186.2756 1190.7396 1197.1889 1202.5832 1206.5318 1208.9485 1221.4809 1226.1062 1231.0748 1272.6235 1274.2086 1278.7798 1290.2985 1304.0871 1320.0086 1320.6219 1350.5453 1369.7859 1378.2920 1381.3201 1381.8724 1386.7757 1392.4311 1397.2692 1401.5559 1407.0940 1430.0522 1431.1851 1451.9573 1457.7606 1470.0750 1545.4167 1565.4181 1568.2849 1594.0109 1601.3598 1604.4432 1632.0693 1634.3211 3127.0774 3133.9826 3155.2077 3155.7715 3169.4927 3171.4095 3171.8019 3173.7208 3174.7717 3188.5590 3189.9828 3190.4860
redmass: 10.1471 10.2697 9.2443 14.9388 13.8675 13.0365 11.6385 12.8985 11.4977 10.8141 12.1075 8.2928 5.8698 6.1195 10.3051 11.0874 7.0910 9.0281 8.3616 6.8884 7.2874 7.6669 13.3388 10.3575 5.8365 5.7877 6.3095 3.0641 4.2302 5.8093 5.5090 5.0838 12.6459 12.1768 9.2349 7.5661 10.0209 7.3453 6.6027 8.1547 8.0455 8.3136 3.7396 6.2381 5.8572 5.3387 5.2774 7.4831 6.8373 6.4563 4.0429 4.9511 6.2448 7.3880 8.3793 6.9311 6.5055 6.2091 9.8987 9.3580 8.0613 8.6653 8.0352 7.7448 9.1540 4.6754 7.3046 4.3677 4.8657 5.9818 12.2122 8.2648 6.1153 7.4403 3.2600 1.6508 1.9694 6.3803 1.9764 2.2320 2.6273 4.6216 2.2331 1.3982 1.4856 1.1833 1.1505 1.3938 1.3629 1.3548 3.0547 4.7417 4.6647 8.4483 2.0187 2.0372 2.5819 2.6664 1.7334 9.2728 1.6989 6.6440 1.6086 7.5653 7.6540 2.4402 10.4815 10.7035 1.5086 1.8790 1.6696 1.6444 2.6048 1.5273 1.4992 7.7621 5.3653 6.8825 9.9467 7.5723 6.6431 8.7373 7.3924 5.0975 4.3563 3.2509 3.2243 2.7620 2.8738 3.1920 9.6041 6.2367 6.2605 6.3451 7.0979 7.1332 5.4084 5.5355 1.0913 1.0915 1.0888 1.0888 1.0905 1.0908 1.0914 1.0909 1.0905 1.0914 1.0977 1.0976
irintensity: 0.7538 2.8171 4.9092 0.3211 0.3373 0.2257 1.3554 1.2447 3.1334 1.2142 2.2781 1.6770 1.6911 0.9533 2.5447 0.5428 0.9535 1.9923 5.3885 0.5491 2.4160 0.2697 4.0375 0.9175 0.5347 3.3904 5.4128 1.9885 8.5712 1.5399 0.4211 0.5526 8.6947 1.2756 0.2619 1.9509 1.9664 0.1516 0.3559 1.2449 3.9748 1.6066 2.3181 2.4463 3.2455 1.0745 4.7733 5.3492 6.5973 4.4733 6.0987 1.6842 1.3622 5.4777 0.4462 27.9676 13.0570 2.5597 13.6149 8.0805 21.7218 2.6253 5.9796 7.4065 2.6436 11.6110 0.8255 37.2449 17.2866 13.7990 53.1310 1.0565 4.1261 7.7912 21.6749 7.8019 61.9861 24.8316 13.8144 3.1907 17.0229 3.6380 3.5401 1.3978 12.1041 22.9444 73.3862 16.7766 2.2367 2.3736 26.8497 1.2777 4.6656 3.6847 11.2795 8.9195 6.8943 5.4757 75.4548 412.8084 18.4946 510.4545 2.5841 160.0713 177.9149 94.4354 73.4850 59.6397 6.2995 14.5201 20.6387 25.1734 150.0381 40.7147 12.7968 98.9429 117.4952 39.6550 83.9741 82.6851 4.3817 19.6227 213.8688 39.4891 41.0159 20.6681 20.1799 9.6715 15.9132 87.8379 152.5791 0.8959 0.1901 229.8848 6.2340 83.4110 59.8593 4.8980 11.4660 10.9732 3.8230 4.5649 1.0280 1.7656 1.5591 17.4677 16.2434 28.7113 3.6065 4.8704
temp: 298.150 k
press: 1.00000 atm
elementType: 8 8 8 8 8 8 8 8 8 8 8 8 7 7 7 7 7 7 6 6 6 6 6 6 6 6 6 6 6 6 6 6 6 6 6 6 6 6 6 6 1 1 1 1 1 1 1 1 1 1 1 1
symmnumber: 1
zpe: 861299.7 jmol-1
zpe.correction: 0.328052 hartree
zpe.thermalcorrener: 0.363422 hartree
zpe.thermalcorrenthalpy: 0.364366 hartree
zpe.thermalcorrgfe: 0.251274 hartree
zpe.sumelectzpe: -2073.373446 hartree
zpe.sumelectthermal: -2073.338076 hartree
zpe.sumelectthermalent: -2073.337131 hartree
zpe.sumelectthermalfe: -2073.450224 hartree
dipole: -0.1313 5.9290 0.3640
dipole: 5.9417
quadrupole: -178.9383 -316.2631 -232.0036
quadrupole: 2.2649 -8.4855 3.5441
quadrupole: 63.4634 -73.8615 10.3981 2.2649 -8.4855 3.5441
hfenergy: -2073.7014975 hartree
pointgroup: C01 [X(C22H12N6O12)]
dipole: -0.0322017 2.335972 0.0818222 debye
polarizability: 611.5835755|-0.0583083|557.9720812|-3.4826276|-10.5638431|155.8008959 unknown
InChI: InChI=1S/C22H12N6O12/c29-23(30)17-5-1-3-13(21(17)27(37)38)7-9-15-11-16(20(26(35)36)12-19(15)25(33)34)10-8-14-4-2-6-18(24(31)32)22(14)28(39)40/h1-12H
charge 0 multiplicity 1
52 atoms
O  3.531758 4.238436 -0.609034
O  -2.312011 6.103432 -0.009762
O  2.325163 6.069546 -0.00067
O  -3.58771 4.255233 -0.372015
O  -1.943035 -2.313232 -1.442097
O  2.417165 -2.853134 1.593549
O  -2.069131 -2.873484 0.773582
O  1.708911 -2.43403 -0.540575
O  -4.034819 -4.518881 -0.701485
O  6.227864 -4.443626 0.766771
O  -6.152548 -4.569147 0.148808
O  4.097484 -4.57715 -0.047138
N  2.429573 4.806534 -0.236364
N  -2.44941 4.828665 -0.144438
N  -2.549111 -2.382643 -0.310309
N  2.586401 -2.41285 0.39938
N  -5.085146 -3.949792 -0.220256
N  5.140026 -3.91741 0.320988
C  -1.272435 2.554373 0.039473
C  1.242363 2.542009 0.002219
C  -0.017524 1.892299 0.088835
C  1.20504 3.973657 -0.097101
C  -1.227273 3.9862 -0.052526
C  -0.007781 4.680711 -0.103288
C  -2.518248 1.778333 0.161579
C  2.489731 1.767353 0.104886
C  -3.901425 -0.295428 -0.144816
C  3.865392 -0.317977 -0.090271
C  -2.653268 0.480617 -0.253628
C  2.598318 0.431676 -0.176905
C  -3.885331 -1.719093 -0.213253
C  3.883932 -1.727674 0.117625
C  -5.0796 -2.465127 -0.106635
C  5.105168 -2.434903 0.183463
C  -5.169877 0.335857 0.01694
C  5.12537 0.337757 -0.228145
C  -6.319582 -1.820056 0.071741
C  6.337209 -1.765234 0.059968
C  -6.356233 -0.411953 0.131229
C  6.338638 -0.369298 -0.14437
H  -0.023882 0.814403 0.269828
H  -0.004514 5.771275 -0.171203
H  -3.372794 2.29815 0.599581
H  3.377124 2.319742 0.421591
H  -1.809035 -0.024437 -0.738854
H  1.727768 -0.135451 -0.526224
H  -5.222077 1.428744 0.023457
H  5.141451 1.412423 -0.433976
H  -7.22283 -2.430768 0.14676
H  7.260908 -2.347233 0.112384
H  -7.314989 0.100964 0.248714
H  7.288054 0.160921 -0.261014
