program: Gaussian 09
title: 000276652
version: EM64L-G09RevD.01
frameworkgroup: C1[X(C11H8N2O3S2)]
method: RPBEPBE
basis: SDD
operation: Freq
keyword: #p
keyword: freq=noraman
keyword: PBEPBE/SDD
title: #p freq=noraman PBEPBE/SDD
converged: NO YES NO NO
title: Mulliken charges:
elementType: S S O O O N N C C C C C C C C C C C H H H H H H H H
charge: 0.309938 0.162056 -0.167470 -0.439346 -0.263779 -0.136745 -0.027745 0.289760 -0.777830 0.304820 0.111623 -0.511177 -0.302986 -0.335601 -0.309834 -0.221338 -0.216843 0.134975 0.306930 0.306541 0.335333 0.290861 0.285134 0.241154 0.240950 0.390619
chargesum: 0.00000
title: Mulliken charges with hydrogens summed into heavy atoms:
elementType: S S O O O N N C C C C C C C C C C C
charge: 0.309938 0.162056 -0.167470 -0.048727 -0.263779 -0.136745 -0.027745 0.289760 -0.164359 0.304820 0.111623 -0.511177 0.032348 -0.044740 -0.024700 0.019816 0.024107 0.134975
polarizability: 2.90741890e+02 -3.09269342e+00 1.89883602e+02 -1.90579676e+01 -6.58849808e+00 1.08922971e+02
1716.lowfreq: -7.3120 -4.6321 -0.0030 -0.0014 -0.0010 4.6804 16.5766 34.0724 44.4756
frequency: 16.1425 34.0553 44.4578 54.4590 80.8294 112.1755 113.2074 150.3351 173.7204 191.4007 240.4966 274.1434 282.5199 348.2662 372.8511 393.5087 409.6540 427.4126 481.8398 499.0412 503.8615 511.6696 527.4002 578.9072 593.4636 598.9143 608.3454 653.6670 686.9238 720.9904 746.7046 766.2257 795.1161 834.7600 873.9368 890.5761 914.9080 962.6715 984.7619 997.0281 1001.9819 1016.5883 1040.7712 1046.6662 1104.3117 1118.5083 1158.1455 1180.7785 1188.3361 1214.3661 1226.3815 1237.4196 1289.6264 1310.1996 1345.3593 1391.4300 1422.0345 1431.7256 1477.8402 1536.2651 1581.1803 1605.5513 1631.3651 1653.3227 3049.6531 3122.5224 3133.0940 3141.1412 3158.5443 3173.4715 3189.8067 3530.8669
redmass: 8.9736 10.3948 10.1011 10.1698 10.9752 4.4844 3.1794 5.0227 7.0972 8.5757 6.0653 6.1815 7.2879 7.3457 8.7904 18.0803 5.4196 4.1423 7.8276 7.9418 11.7942 4.7525 4.4241 4.2750 1.2640 5.6518 4.9291 6.8540 3.5755 5.7130 4.6837 2.7453 1.7558 6.2493 5.0165 1.6907 1.3795 3.3859 2.0355 1.4388 5.0153 1.3647 8.7824 2.3716 2.0349 1.1579 1.7869 1.0817 6.5573 5.1422 1.6839 1.6030 1.7810 2.2833 1.8834 6.4416 1.0778 2.2812 2.6996 5.9439 6.1951 6.3077 7.6783 12.7581 1.0568 1.1068 1.0933 1.0870 1.0921 1.0969 1.0961 1.0642
irintensity: 0.2464 1.4145 3.5734 0.3143 1.7331 1.5758 8.9928 2.6566 5.8010 0.4705 12.6962 2.6103 4.1175 0.3898 6.6648 6.0231 10.7622 11.7308 47.2503 7.3545 7.1490 4.7147 0.0988 5.9650 98.0053 14.2883 37.7043 4.6590 71.2022 7.3851 7.2936 34.7974 27.5425 12.5993 41.0532 14.2359 0.4493 19.7555 7.4265 10.6091 302.0412 0.4051 11.5543 8.3207 93.6864 1.7178 91.5560 5.5970 283.6373 363.9636 61.8131 50.8270 40.5830 65.3050 11.9419 11.6486 13.0682 10.7082 33.1626 17.9070 12.5118 22.0191 198.8360 261.1167 3.7343 0.0509 31.6146 2.8175 12.1401 9.1659 6.7772 62.0239
temp: 298.150 k
press: 1.00000 atm
elementType: 16 16 8 8 8 7 7 6 6 6 6 6 6 6 6 6 6 6 1 1 1 1 1 1 1 1
symmnumber: 1
zpe: 455541.6 jmol-1
zpe.correction: 0.173507 hartree
zpe.thermalcorrener: 0.189882 hartree
zpe.thermalcorrenthalpy: 0.190826 hartree
zpe.thermalcorrgfe: 0.126553 hartree
zpe.sumelectzpe: -1553.975091 hartree
zpe.sumelectthermal: -1553.958716 hartree
zpe.sumelectthermalent: -1553.957772 hartree
zpe.sumelectthermalfe: -1554.022044 hartree
dipole: -2.2519 0.6580 -0.3640
dipole: 2.3741
quadrupole: -87.8833 -119.4599 -121.2657
quadrupole: 2.6367 -4.5306 10.5102
quadrupole: 21.6530 -9.9236 -11.7294 2.6367 -4.5306 10.5102
hfenergy: -1554.1485976 hartree
pointgroup: C01 [X(C11H8N2O3S2)]
dipole: -0.8422876 0.3320051 -0.2296912 debye
dipolederiv: -0.7853891 -0.0158903 -0.010968 0.0219814 -0.001982 0.0251392 -0.0043104 0.0238782 0.0180651 -0.4695897 -0.3061672 0.1278977 -0.209645 -0.5557034 0.1816887 0.0297921 0.191068 -0.1466602 -0.3846031 0.1132033 -0.0484898 -0.4012062 -1.1676422 0.2106918 0.0756593 0.2412818 -0.3633366 -0.994731 -0.4636815 -0.4201453 -0.4869697 -0.6245359 -0.222463 -0.4168965 -0.1806569 -0.6024895 -0.8722146 0.079987 0.0823513 0.1175221 -0.591641 -0.3017511 0.0468373 -0.2686657 -0.5572796 -1.0468043 -0.4233027 -0.023581 0.2113241 -1.4864637 0.5103543 0.0725616 0.3758125 -0.098972 0.0337217 -0.067545 0.1124265 -0.1701636 -0.1803899 0.0571278 -0.3550706 0.0641689 -0.1665447 -0.1045476 0.1670819 0.127291 0.0315913 0.0680211 0.0459735 -0.003281 0.0488795 0.0432368 -0.4203653 0.1684257 -0.0503156 0.0930245 0.1409913 -0.0129392 -0.0524278 0.001111 0.0998841 1.0532859 0.3749539 -0.0532697 0.8863644 1.5440046 -0.2910001 -0.042667 -0.3742585 0.3164301 0.1155777 0.0085489 0.0467616 -0.0148427 -0.3719231 -0.3297768 0.0062708 -0.3009364 -0.2602265 1.2189366 0.196431 -0.0851141 -0.1818142 1.3233286 -0.6246486 -0.0253945 -0.4797042 -0.009174 0.7471542 -0.1451661 0.0246912 -0.4160548 0.2444245 -0.0486889 0.1096924 -0.0105972 0.0762226 -0.1724818 0.1546504 0.1121934 0.108511 -0.143077 -0.0103769 0.0861767 -0.018313 -0.0822238 -0.1855082 -0.0264656 -0.0609049 0.2826093 -0.0454829 0.1127171 0.2005611 0.0517402 -0.0195926 0.0792508 -0.1018468 -0.0408078 -0.0774145 0.0883943 0.1477667 -0.0381676 0.1490467 -0.014797 0.0333511 -0.0712267 -0.0460616 -0.2304574 -0.0907754 -0.0142219 -0.1543401 0.0344665 -0.1526666 1.4542542 0.1754508 0.139501 0.3045741 1.1268846 0.8590929 0.2939582 0.7345903 0.9280735 0.0913506 -0.0037043 0.0397743 -0.0420028 0.0310516 0.0416202 0.0756946 0.0374828 0.0180137 0.0899105 -0.0153285 -0.0379494 -0.068759 0.0016008 -0.0226387 -0.0457664 -0.0283747 0.0590312 0.1162803 0.0419575 0.024361 0.1090924 0.0770491 -0.0112474 0.1205313 0.0081625 0.1743867 0.0880455 -0.0564995 -0.0521327 -0.049363 0.1048097 -0.0464534 -0.0536251 -0.0290502 0.1007337 0.0355825 -0.0298874 -0.0499077 -0.0400116 0.1218321 -0.0344576 -0.0462133 -0.0398274 0.1172326 0.0754835 0.0327715 0.0133447 0.0619324 -0.0030209 -0.1108785 0.0310712 -0.1193834 0.061059 -0.0890184 0.0741837 0.0169921 0.0592773 0.0943178 -0.0414246 0.0105456 -0.0381602 0.1270672 0.293068 0.1390661 0.1120618 0.1009002 0.2959276 -0.0692056 0.0788083 -0.0737613 0.3345267 unknown
polarizability: 291.206063|-6.047014|187.5505229|15.6896998|15.2762088|110.7918771 unknown
InChI: InChI=1S/C11H8N2O3S2/c14-9-6-18-11(17)13(9)12-5-7-3-1-2-4-8(7)10(15)16/h1-5,15H,6H2
charge 0 multiplicity 1
26 atoms
S  4.483251 -1.392723 0.961525
S  1.66553 -2.554639 1.353892
O  3.076775 2.210885 0.022963
O  -3.412459 -2.051672 -2.001769
O  -1.108809 -1.994691 -1.875971
N  2.281248 0.045105 0.557354
N  0.953721 0.561519 0.627707
C  -1.37612 0.287255 0.117593
C  4.695056 0.418238 0.475705
C  3.303489 1.022078 0.325473
C  -2.44476 -0.360354 -0.591021
C  2.656249 -1.265085 0.92927
C  0.030363 -0.160075 0.01844
C  -1.685732 1.394026 0.956944
C  -3.775051 0.112854 -0.428652
C  -3.005998 1.857182 1.09758
C  -4.058319 1.211117 0.405064
C  -2.211536 -1.510645 -1.514511
H  5.241733 0.491384 -0.477174
H  5.250433 0.951308 1.26303
H  0.24507 -1.048176 -0.585901
H  -0.860278 1.873459 1.490999
H  -4.577149 -0.393104 -0.970585
H  -3.217554 2.71414 1.745816
H  -5.089898 1.561303 0.514473
H  -3.190853 -2.805185 -2.612345
