program: Gaussian 09
title: 000276640
version: EM64L-G09RevD.01
frameworkgroup: C1[X(C7H11NO4)]
method: RPBEPBE
basis: SDD
operation: Freq
keyword: #p
keyword: freq=noraman
keyword: PBEPBE/SDD
title: #p freq=noraman PBEPBE/SDD
converged: NO YES NO NO
title: Mulliken charges:
elementType: O O O O N C C C C C C C H H H H H H H H H H H
charge: -0.221588 -0.171651 -0.172669 -0.172971 -0.151824 -0.482206 0.298653 -0.671711 0.264219 -0.773363 0.272487 -0.742922 0.246462 0.245677 0.211635 0.239630 0.230193 0.249475 0.264323 0.254631 0.263711 0.259805 0.260004
chargesum: 0.00000
title: Mulliken charges with hydrogens summed into heavy atoms:
elementType: O O O O N C C C C C C C
charge: -0.221588 -0.171651 -0.172669 -0.172971 -0.151824 0.009933 0.298653 0.009748 0.264219 -0.004934 0.272487 0.040597
polarizability: 1.10870693e+02 5.28969100e+00 1.11427625e+02 3.14182724e+00 4.09897204e+00 7.12669155e+01
1716.lowfreq: -57.0707 -10.9277 -8.1985 -4.0365 0.0005 0.0006 0.0007 34.2554 51.2052
frequency: -56.9869 34.2058 51.1838 59.1871 83.2230 87.3809 103.7556 157.2938 188.3176 191.7515 271.2342 312.3796 318.7930 345.7277 351.5477 417.6226 518.4365 523.6509 538.4155 564.0205 574.1974 668.6472 724.8248 762.8674 806.8923 847.6214 959.3955 976.7864 999.8860 1025.9864 1033.5317 1038.5465 1080.2654 1082.3047 1131.0203 1140.8043 1217.7584 1251.9796 1329.1033 1377.4966 1385.2848 1399.6040 1442.4344 1449.3814 1450.8579 1455.1565 1466.3579 1468.9733 1479.7191 1619.6591 1674.3189 1709.0325 2984.0694 2999.3462 3001.0995 3009.9761 3041.8177 3091.3991 3097.6018 3099.2337 3107.3090 3135.9976 3138.7480
redmass: 1.0436 9.4065 5.2100 3.8503 3.2590 2.3320 3.0929 3.9802 1.0241 1.2285 4.2435 6.1997 4.9559 5.0238 3.7150 8.9462 2.6574 4.8628 3.5199 2.9477 3.7688 4.5881 6.1003 7.0085 1.3472 4.7642 3.3189 2.2771 2.1627 2.1354 1.6454 1.6342 1.7853 2.4670 3.2904 3.1331 5.0002 1.1742 1.6848 1.2217 1.2034 1.2063 1.0855 1.0626 1.0578 1.0471 1.0514 1.0385 1.0503 9.7614 10.0030 11.7090 1.0620 1.0375 1.0366 1.0365 1.0970 1.0967 1.1003 1.0974 1.1002 1.1006 1.1011
irintensity: 0.7791 0.3050 3.9974 3.9676 0.5032 0.2411 2.0081 1.2782 0.2140 1.3814 0.4951 2.3886 9.8169 11.9688 10.6316 0.0065 1.8977 14.4347 9.8993 3.0613 25.5788 0.7020 7.0099 108.6580 18.0337 7.6504 34.8790 25.5235 0.5703 20.7329 5.3965 3.0937 12.3769 23.4876 182.0206 153.4446 506.0559 2.2936 55.0326 45.4387 50.5761 20.1896 13.1890 29.6134 11.9329 14.9360 25.2977 12.2197 13.5187 23.1610 255.8149 147.2080 19.0793 2.9899 23.8647 0.2795 4.5045 7.5389 24.5878 2.5608 24.9714 7.1641 4.4193
temp: 298.150 k
press: 1.00000 atm
elementType: 8 8 8 8 7 6 6 6 6 6 6 6 1 1 1 1 1 1 1 1 1 1 1
symmnumber: 1
zpe: 459697.5 jmol-1
zpe.correction: 0.175090 hartree
zpe.thermalcorrener: 0.188611 hartree
zpe.thermalcorrenthalpy: 0.189555 hartree
zpe.thermalcorrgfe: 0.133627 hartree
zpe.sumelectzpe: -628.021574 hartree
zpe.sumelectthermal: -628.008052 hartree
zpe.sumelectthermalent: -628.007108 hartree
zpe.sumelectthermalfe: -628.063037 hartree
dipole: -3.5376 -6.0124 -2.9393
dipole: 7.5699
quadrupole: -64.1184 -74.7119 -74.5186
quadrupole: -4.6942 1.5316 -0.6971
quadrupole: 6.9979 -3.5956 -3.4023 -4.6942 1.5316 -0.6971
hfenergy: -628.1966633 hartree
pointgroup: C01 [X(C7H11N1O4)]
dipole: -0.8844436 2.5579542 1.2427313 debye
dipolederiv: -0.5186024 0.2425974 -0.0857113 0.2563597 -0.9802068 0.209013 -0.1605758 0.3539421 -0.4464321 -0.8337152 0.1585526 0.034747 0.3654191 -0.6328614 -0.1021077 0.1685378 -0.111552 -0.2987534 -0.4662198 -0.0256792 0.0417353 -0.2210221 -1.0173675 -0.1079238 -0.0437843 -0.2064101 -0.3156373 -0.3355071 0.0888941 0.0248066 0.0821988 -0.4894171 -0.1188181 -0.1382223 0.2692079 -0.8532702 -1.4646644 -0.5709076 0.011443 -0.6029844 -0.2006789 -0.0121458 -0.0217296 0.0674344 -0.179093 -0.0575228 -0.0564241 -0.0068024 -0.1952049 -0.2256832 -0.0745701 -0.006911 -0.0625548 0.1006149 1.9185632 -0.0687264 -0.068901 -0.140967 0.7206587 0.1853806 -0.2451223 0.1276299 0.2506414 -0.0227847 0.0223454 0.0098018 -0.0095695 0.0752042 0.0005501 -0.0069933 -0.0108078 0.0652458 1.2900412 0.5507474 -0.1070726 0.6664774 1.4351698 0.1965769 0.0705535 0.2726415 0.2715591 -0.4094643 0.045684 0.0768628 0.1410171 -0.0566151 -0.0347103 0.0654122 -0.0195111 0.010185 0.4196581 -0.4657034 0.0689196 -0.4799796 1.3345023 -0.0910491 0.3328758 -0.6938388 1.2190732 -0.0404645 0.1593548 0.0472133 0.1628622 -0.3876552 -0.1275517 -0.0032195 -0.0026029 -0.0363627 0.0276679 -0.0125509 0.0779092 0.0046382 0.0676472 -0.0462364 0.0680682 -0.07307 -0.0374281 0.0158492 0.0338623 -0.0697083 0.051891 -0.0065236 0.0639098 -0.0747948 0.0877948 0.0115738 -0.0173616 -0.0885518 -0.016953 -0.1486897 -0.0971437 -0.0382771 -0.0287458 -0.036793 0.0978152 0.0717985 0.0082611 0.0196852 0.0606433 0.0846905 -0.0684427 0.0656368 -0.0515488 -0.0830817 0.0495751 0.0235255 -0.0261943 0.0862115 0.0069223 0.1142432 -0.047015 0.0987261 -0.0152341 0.0823847 0.0142196 -0.0260966 0.0135698 0.1005582 -0.0896947 0.0262801 -0.0759377 -0.0308628 0.0340335 -0.0602406 0.0092686 -0.1112432 -0.0207088 -0.0017413 0.0058396 -0.0185193 0.1295107 0.0853551 0.0395908 0.0054117 0.058284 0.031145 0.0924312 -0.0284232 0.0927448 0.0170857 0.1281984 0.0007492 -0.0208747 -0.0002147 0.1253966 0.0432314 -0.0056884 0.0046813 -0.0542365 -0.0235059 0.0469592 -0.0421034 0.0067748 0.1071954 -0.0131433 -0.0580867 -0.031278 0.0907355 0.0666879 -0.0865592 0.0426135 -0.0464719 0.025771 0.0210758 0.0661078 0.0196215 0.0863514 unknown
polarizability: 108.7969644|-4.6949002|113.1452636|-2.0877161|6.1408487|71.6230056 unknown
InChI: InChI=1S/C7H11NO4/c1-4-7(11)8(5(2)9)12-6(3)10/h4H2,1-3H3
charge 0 multiplicity 1
23 atoms
O  -0.615731 0.756862 0.747959
O  1.82633 -1.677101 -0.35915
O  -0.81241 -2.68998 -0.350852
O  -0.967063 1.4827 -1.476477
N  -0.128233 -0.518505 0.210579
C  2.075401 0.682984 0.287062
C  1.299349 -0.606757 0.010483
C  3.594019 0.456573 0.183957
C  -1.12745 -1.543959 0.033683
C  -2.552984 -1.117473 0.350537
C  -1.020301 1.716804 -0.263482
C  -1.488481 2.967131 0.439643
H  1.794571 1.071721 1.283831
H  1.752524 1.44924 -0.446317
H  4.13311 1.404074 0.360633
H  3.869634 0.073364 -0.812604
H  3.935664 -0.285446 0.925578
H  -2.633248 -0.657124 1.349606
H  -3.185025 -2.016148 0.300294
H  -2.917473 -0.387761 -0.395385
H  -1.427543 2.866057 1.532691
H  -2.530152 3.182212 0.144447
H  -0.871206 3.821632 0.111782
