program: Gaussian 09
title: 000276653
version: EM64L-G09RevD.01
frameworkgroup: C1[X(C10H6ClFN2OS2)]
method: RPBEPBE
basis: SDD
operation: Freq
keyword: #p
keyword: freq=noraman
keyword: PBEPBE/SDD
title: #p freq=noraman PBEPBE/SDD
converged: YES YES NO NO
title: Mulliken charges:
elementType: Cl S S F O N N C C C C C C C C C C H H H H H H
charge: -0.029502 0.314322 0.154272 -0.157916 -0.161057 -0.139839 0.029497 -0.777333 0.306348 0.362149 -0.512912 -0.275981 -0.250307 0.247786 -0.242431 -0.372064 -0.174439 0.306765 0.309164 0.281386 0.266559 0.267965 0.247569
chargesum: 0.00000
title: Mulliken charges with hydrogens summed into heavy atoms:
elementType: Cl S S F O N N C C C C C C C C C C
charge: -0.029502 0.314322 0.154272 -0.157916 -0.161057 -0.139839 0.029497 -0.161404 0.306348 0.362149 -0.512912 0.005405 -0.250307 0.247786 0.024128 -0.104100 0.073130
polarizability: 2.78417517e+02 -2.10185258e+00 1.73288767e+02 -1.35195604e+01 1.10376609e+01 1.07571253e+02
1716.lowfreq: -4.0932 -0.0029 -0.0021 -0.0015 2.4173 4.4060 15.8399 39.7657 43.4322
frequency: 15.3088 39.7488 43.4218 76.9776 84.7322 112.9847 143.1152 169.0913 197.1711 221.1677 239.3524 283.5468 292.6176 365.2732 368.0023 382.0801 393.8356 456.1426 498.7181 501.4139 505.5863 520.7662 539.2880 557.4643 585.9113 614.0438 682.1599 725.7089 728.2468 788.9599 805.3543 834.2643 888.1808 890.3786 894.1198 945.7824 970.1091 971.9594 1034.4303 1065.4599 1118.8416 1137.7913 1180.1562 1187.3329 1213.5014 1215.7722 1236.0543 1248.7983 1349.5211 1387.1181 1422.6043 1423.6422 1450.0325 1549.5360 1573.9751 1604.8959 1656.4525 3050.2190 3111.1705 3123.2819 3159.4953 3180.9803 3191.0628
redmass: 14.8138 8.2915 9.6028 14.5299 15.2519 3.0917 6.5801 8.1372 7.7908 5.1758 9.0167 7.6273 12.7163 7.2493 9.2003 10.7325 18.3301 7.5835 8.8195 7.9678 10.5872 4.0457 6.9458 4.8967 4.3545 7.0658 6.8691 5.0725 3.1759 1.6012 5.6287 7.6195 2.4893 1.3782 2.8744 1.7437 1.3562 5.0957 10.0475 1.9389 1.1602 2.4359 2.0614 2.5071 4.7510 3.0602 1.5310 2.2663 2.4918 2.6749 1.0802 2.5481 3.4670 6.3942 5.8037 8.1479 12.7835 1.0569 1.0900 1.1068 1.0881 1.0930 1.0996
irintensity: 0.0940 1.7951 4.0175 0.6311 2.1477 8.6654 3.9651 5.1787 0.4832 5.1768 2.8734 12.3249 1.8228 7.5615 1.1370 14.8510 1.9641 29.0684 8.1011 10.5720 5.8789 1.0834 2.4755 1.2498 0.3234 15.3477 2.0730 2.8489 23.4869 62.3161 36.2911 32.4685 8.6136 0.2665 48.5638 19.4861 1.5927 8.0970 21.4847 1.6015 3.1175 1.7353 119.0708 145.4565 311.8084 153.8456 33.8518 47.5313 4.7370 0.7589 13.6163 53.9484 30.7850 40.7791 59.8681 84.1073 260.5944 3.4413 7.7769 0.0793 3.1605 0.7039 3.8993
temp: 298.150 k
press: 1.00000 atm
elementType: 17 16 16 9 8 7 7 6 6 6 6 6 6 6 6 6 6 1 1 1 1 1 1
symmnumber: 1
zpe: 372069.2 jmol-1
zpe.correction: 0.141714 hartree
zpe.thermalcorrener: 0.157413 hartree
zpe.thermalcorrenthalpy: 0.158357 hartree
zpe.thermalcorrgfe: 0.095673 hartree
zpe.sumelectzpe: -1924.172971 hartree
zpe.sumelectthermal: -1924.157272 hartree
zpe.sumelectthermalent: -1924.156328 hartree
zpe.sumelectthermalfe: -1924.219012 hartree
dipole: 2.3695 -0.2470 0.8457
dipole: 2.5280
quadrupole: -81.7636 -129.2631 -123.0916
quadrupole: -0.5350 -6.8451 -7.1784
quadrupole: 29.6092 -17.8903 -11.7188 -0.5350 -6.8451 -7.1784
hfenergy: -1924.314685 hartree
pointgroup: C01[X(C10H6Cl1F1N2O1S2)]
dipole: -0.9284075 0.3003038 0.1925641 debye
dipolederiv: -0.129448 -0.167967 0.0332383 -0.0361817 -0.6305423 0.1308775 0.0100293 0.1495006 -0.0718424 -0.7557688 -0.0233658 -0.1305569 -0.046354 0.0343521 -0.0074172 -0.1026989 -0.0054769 -0.032956 -0.4040286 0.0179096 -0.3024704 0.0553377 -0.0927728 0.098338 -0.152935 0.0935047 -0.6944468 -0.3578574 0.325806 -0.0786295 0.1542293 -0.6897991 0.1589811 -0.0532419 0.1495345 -0.1464754 -0.3637815 -0.0504806 0.23718 0.0936083 -0.3535114 0.2324302 -0.2537017 0.2259309 -1.1809683 -1.0233811 0.1132234 -0.2956447 -0.2948144 -0.0771628 0.4051125 0.2178199 0.3671583 -1.5502699 0.0713465 0.0035708 -0.0927044 0.4163182 -0.0611503 0.0374351 0.0934485 -0.0091637 -0.2261009 -0.4472334 -0.0632541 0.0797394 -0.0234978 0.1040086 -0.022795 0.0184623 -0.0154453 0.1625313 0.9075204 -0.0481967 0.2655983 -0.3116076 0.3026656 -0.3560198 0.6748655 -0.3731902 1.7090399 -0.4897224 -0.1139829 0.0235133 -0.0501423 -0.380873 0.0884617 0.0315291 0.0945345 -0.0137207 1.1905291 0.0825142 0.1856055 0.2349906 -0.1300296 -0.3651759 -0.1738508 -0.2688807 1.4661876 0.9880722 0.0403073 -0.0004784 0.155303 0.1477562 -0.0830258 -0.295088 -0.0823576 0.1737546 0.4143995 0.3748438 -0.066927 -0.1677592 0.9574555 -0.2236891 0.080732 -0.2621399 -0.0001026 0.5502657 -0.3815782 0.096039 0.0016583 0.7737924 -0.1667944 -0.004477 -0.1746849 0.1638338 -0.2598893 -0.2653209 0.0670689 -0.2581203 -0.3161415 0.0359602 0.0683156 0.0428592 -0.1192739 -0.2955281 0.2478445 -0.058547 0.0618213 -0.0653098 -0.0327125 -0.0187058 -0.0187197 -0.1513221 0.0759003 -0.0603928 0.0284182 0.0807216 0.2332836 -0.0877833 -0.0157873 -0.0999247 -0.0912645 0.1079948 -0.0259092 -0.0047635 -0.037873 0.0540804 -0.0283897 -0.0555533 -0.0338554 -0.019082 0.0929856 0.0356962 0.0134558 0.0661381 0.0285998 0.0507488 -0.0279081 0.0377355 0.0381056 0.0675359 -0.0260364 0.0103981 -0.0866539 0.0444916 0.0273816 -0.0248349 0.0716994 0.1047797 0.0455627 0.0444637 -0.0141432 0.0678922 0.0326358 0.0406729 -0.0256601 0.0400115 0.1588992 0.0824479 -0.0237096 0.0024812 -0.0424299 0.0006401 0.0481942 0.0085594 0.0497759 0.1669655 -0.067922 -0.0359853 0.002129 -0.0325845 0.0835309 0.0192086 0.0006812 0.0215939 0.1537285 unknown
polarizability: 278.6320077|5.5482301|134.3925802|10.8036005|-34.2990517|146.2529495 unknown
InChI: InChI=1S/C10H6ClFN2OS2/c11-7-2-1-3-8(12)6(7)4-13-14-9(15)5-17-10(14)16/h1-4H,5H2
charge 0 multiplicity 1
23 atoms
Cl -2.067096 2.838632 -0.788917
S  4.452059 0.581709 -0.864438
S  1.854356 0.708422 -2.499396
F  -1.288818 -2.173934 0.61291
O  2.545294 -0.503577 2.455775
N  2.071265 0.067258 0.206488
N  0.719941 -0.363441 0.391946
C  4.400154 0.070884 0.950518
C  2.941505 -0.169107 1.322356
C  -1.620355 0.154847 -0.027715
C  2.633633 0.450202 -1.030577
C  -0.189111 0.474582 -0.072455
C  -2.595871 1.148603 -0.345939
C  -2.155038 -1.125316 0.306591
C  -3.978949 0.904158 -0.330726
C  -3.528313 -1.410935 0.331532
C  -4.443271 -0.385893 0.012117
H  4.824042 0.868409 1.579797
H  4.976747 -0.856919 1.090593
H  0.06491 1.460986 -0.481219
H  -4.678574 1.705276 -0.580539
H  -3.858263 -2.418893 0.595901
H  -5.518244 -0.588452 0.027997
