program: Gaussian 09
title: 000276642
version: EM64L-G09RevD.01
frameworkgroup: C1[X(C10H6Cl2N2OS2)]
method: RPBEPBE
basis: SDD
operation: Freq
keyword: #p
keyword: freq=noraman
keyword: PBEPBE/SDD
title: #p freq=noraman PBEPBE/SDD
converged: YES YES NO NO
title: Mulliken charges:
elementType: Cl Cl S S O N N C C C C C C C C C C H H H H H H
charge: -0.004205 0.008268 0.317133 0.129840 -0.148433 -0.143696 0.007589 -0.787158 0.323669 0.451655 -0.481701 -0.316120 -0.360650 -0.364995 -0.065516 -0.188831 -0.093817 0.311217 0.311203 0.270532 0.262777 0.297579 0.263660
chargesum: 0.00000
title: Mulliken charges with hydrogens summed into heavy atoms:
elementType: Cl Cl S S O N N C C C C C C C C C C
charge: -0.004205 0.008268 0.317133 0.129840 -0.148433 -0.143696 0.007589 -0.164738 0.323669 0.451655 -0.481701 -0.045588 -0.097873 -0.067416 -0.065516 0.074829 -0.093817
polarizability: 3.48423536e+02 -7.73728584e+00 2.05196429e+02 7.64646419e-01 -4.31223074e-01 6.74888741e+01
1716.lowfreq: -4.4345 -0.0013 0.0008 0.0031 1.3962 5.3850 12.9737 32.9461 48.4214
frequency: 12.5537 32.9416 48.4151 59.5341 99.9339 114.7797 145.6961 157.8680 173.6955 196.8395 206.7110 262.9732 279.4227 322.9883 380.7984 387.7739 397.6052 431.5986 440.7560 461.2661 501.2117 512.6463 524.5077 564.3666 604.0427 619.4608 653.2334 709.3420 710.7643 739.5574 841.9809 847.8700 870.1654 882.6442 890.8318 956.8249 972.0683 991.0863 1002.4809 1042.6856 1118.5370 1125.4033 1142.9591 1158.1843 1196.5377 1226.1993 1241.8904 1269.5595 1343.5013 1382.3763 1387.5621 1421.7245 1464.3396 1546.0309 1572.9010 1595.8224 1677.1915 3048.8160 3093.4370 3120.3381 3151.4720 3161.0636 3179.0621
redmass: 11.2303 11.7968 11.8309 11.1641 3.2246 5.1577 6.9983 16.3502 14.2718 18.3531 4.2788 18.8080 6.4483 9.8608 7.0784 11.0708 15.7250 11.2542 3.1471 6.9999 17.6828 6.1030 7.3193 4.3423 4.9580 7.1760 7.2126 5.4726 4.2840 5.5688 1.3360 8.6910 5.4378 1.4550 1.6366 7.2454 1.5361 1.3763 5.2635 9.0469 2.3114 1.1564 1.3168 9.2119 4.3706 1.7202 1.4493 1.7349 2.5850 3.5973 3.0620 1.0757 2.9868 8.3958 6.6773 6.7825 12.8394 1.0571 1.0916 1.1064 1.0926 1.0888 1.0977
irintensity: 0.3729 0.5677 0.6864 3.9548 6.1003 1.6047 5.0847 1.4561 1.0713 0.3540 9.1960 0.2005 2.1514 8.0551 0.5345 2.7767 6.3779 55.1096 8.3827 21.3837 4.4669 5.6164 17.6440 7.2469 1.7417 4.3655 19.5446 5.3837 6.1000 9.5628 27.7282 28.2184 39.2876 13.2771 4.0491 13.7348 30.8215 6.3463 41.1037 19.7780 71.4596 0.3578 11.2126 407.0813 206.5459 181.5977 47.8540 79.4113 16.5675 6.2524 32.3131 15.3185 43.0147 56.2412 7.4046 22.5196 209.1734 3.0141 2.2959 0.0051 0.3409 0.3399 2.5136
temp: 298.150 k
press: 1.00000 atm
elementType: 17 17 16 16 8 7 7 6 6 6 6 6 6 6 6 6 6 1 1 1 1 1 1
symmnumber: 1
zpe: 368909.4 jmol-1
zpe.correction: 0.140510 hartree
zpe.thermalcorrener: 0.156573 hartree
zpe.thermalcorrenthalpy: 0.157518 hartree
zpe.thermalcorrgfe: 0.093280 hartree
zpe.sumelectzpe: -2284.398743 hartree
zpe.sumelectthermal: -2284.382679 hartree
zpe.sumelectthermalent: -2284.381735 hartree
zpe.sumelectthermalfe: -2284.445973 hartree
dipole: 2.7994 -1.1873 0.1956
dipole: 3.0470
quadrupole: -121.5686 -131.3160 -126.9771
quadrupole: -6.5815 1.1250 1.2845
quadrupole: 5.0520 -4.6955 -0.3565 -6.5815 1.1250 1.2845
hfenergy: -2284.5392527 hartree
pointgroup: C01 [X(C10H6Cl2N2O1S2)]
dipole: -1.1254942 0.2608367 0.3198868 debye
dipolederiv: -0.4518505 0.2256005 0.2016792 0.3046241 -0.215788 -0.1714 0.2945441 -0.1833275 -0.1995798 -0.9099355 -0.1074469 -0.2325635 -0.1477779 -0.0537752 -0.0553519 -0.2725281 -0.0499009 -0.1111424 -0.835365 0.1460389 0.1120307 0.1262371 -0.0017732 -0.0398983 0.0725988 -0.0373494 -0.020523 -0.3846196 0.167299 0.2266039 0.0776336 -0.3000628 -0.2911191 0.073674 -0.2728217 -0.5180019 -0.322305 -0.1349167 -0.2073636 0.1656749 -0.5660898 -0.3777161 0.2280541 -0.4190757 -0.8825445 -1.317007 0.2477348 0.151683 -0.2533439 -0.4371182 -0.7662748 -0.4483408 -0.6901837 -1.0519726 0.2067771 -0.0618213 -0.0090905 0.4571909 -0.131428 0.0624767 0.475587 -0.0026721 -0.0798462 -0.454703 0.0064309 -0.0603501 0.0391095 0.1288961 0.0474511 -0.0214014 0.0399986 0.1581364 0.8971766 -0.1672634 -0.1552489 -0.5686461 0.717811 0.6592896 -0.6720664 0.7155532 1.1797988 -0.3472048 -0.0372463 -0.0881241 -0.1347188 0.0023083 -0.0088124 -0.199429 0.0074679 -0.0203907 1.2658698 -0.1818613 -0.0962919 0.1115461 0.3171626 0.7797956 0.2971926 0.7229613 0.9984143 0.9797053 0.0344243 0.1568752 0.008108 0.0527869 0.0729327 0.173589 0.090475 0.083597 -0.0299737 0.1466977 0.1740384 -0.0417455 -0.1161451 -0.0186091 -0.0333269 0.0087979 -0.1011648 0.0016499 -0.0296691 -0.0198822 0.1040107 -0.0748774 0.0605541 0.1335034 0.0466293 -0.0483281 0.3920778 -0.485223 -0.4964528 -0.6112234 0.2492167 0.2379934 -0.6442507 0.2578419 0.179574 -0.3962 -0.0166082 -0.0583014 0.092515 -0.0222651 0.0803176 0.0651357 0.0650831 0.0023457 1.0919318 0.2643561 0.4387469 0.2388089 -0.0172731 0.0719742 0.4058716 0.0732659 0.0793202 0.1064059 -0.0344166 0.0084406 -0.0260365 0.0775905 -0.0037069 0.0592828 -0.00854 -0.0232399 0.118115 0.0081444 -0.0313891 0.0531118 -0.0110663 -0.0339933 -0.0015872 -0.0340471 0.0584493 0.1532972 0.0063708 0.0087729 0.0107708 0.1089188 -0.0934477 0.0461109 -0.1134854 0.0864818 0.0954025 -0.0329729 -0.0460529 -0.0236596 0.0939292 -0.0789551 -0.033738 -0.0825852 0.0635026 0.0870739 0.0492399 0.0493676 0.0376832 0.1141494 -0.0445994 0.0380006 -0.0455513 0.1111669 0.0536813 -0.0128915 -0.0271274 -0.0198729 0.0848924 -0.0889008 -0.0364762 -0.088534 0.0559468 unknown
polarizability: 347.080342|-18.1166797|118.1950181|12.8095566|65.1039876|155.8334787 unknown
InChI: InChI=1S/C10H6Cl2N2OS2/c11-7-2-1-6(3-8(7)12)4-13-14-9(15)5-17-10(14)16/h1-4H,5H2
charge 0 multiplicity 1
23 atoms
Cl 4.84762 -1.585413 -1.35365
Cl 5.625694 0.482351 1.082947
S  -4.972419 -0.228604 -1.157554
S  -2.510317 -1.360039 -2.56548
O  -2.86856 1.538496 1.70645
N  -2.502475 0.183839 -0.220262
N  -1.134311 0.307054 0.075727
C  -4.804027 0.808846 0.401797
C  -3.324471 0.913584 0.734972
C  1.199994 -0.137275 -0.148034
C  -3.155939 -0.471534 -1.28551
C  -0.195501 -0.360199 -0.561605
C  2.227172 -0.842751 -0.827996
C  1.545219 0.754696 0.906849
C  3.573711 -0.661656 -0.46041
C  2.890583 0.932373 1.268032
C  3.908912 0.224872 0.585806
H  -5.340119 0.327434 1.234587
H  -5.219305 1.814442 0.231955
H  -0.382134 -1.06799 -1.379533
H  1.982383 -1.532146 -1.64299
H  0.746943 1.292453 1.426228
H  3.168047 1.614667 2.076675
