program: Gaussian 09
title: 000276624
version: EM64L-G09RevD.01
frameworkgroup: C1[X(C9H5F3O6S2)]
method: RPBEPBE
basis: SDD
operation: Freq
keyword: #p
keyword: freq=noraman
keyword: PBEPBE/SDD
title: #p freq=noraman PBEPBE/SDD
converged: YES YES NO NO
title: Mulliken charges:
elementType: S S F F F O O O O O O C C C C C C C C C H H H H H
charge: 0.852091 0.091903 -0.135550 -0.138455 -0.130909 -0.448474 -0.446255 -0.433303 -0.432578 -0.219518 -0.219676 -0.088401 -0.288022 -0.301166 0.286022 0.287776 -0.464467 0.128808 0.129182 0.180432 0.332402 0.333636 0.320916 0.401699 0.401908
chargesum: 0.00000
title: Mulliken charges with hydrogens summed into heavy atoms:
elementType: S S F F F O O O O O O C C C C C C C C C
charge: 0.852091 0.091903 -0.135550 -0.138455 -0.130909 -0.448474 -0.446255 -0.031603 -0.030670 -0.219518 -0.219676 -0.088401 0.044379 0.032470 0.286022 0.287776 -0.143551 0.128808 0.129182 0.180432
polarizability: 2.43369474e+02 3.49446468e+00 1.84987091e+02 2.32258370e+00 7.10243274e-04 1.19642437e+02
1716.lowfreq: -3.4026 -3.0726 -0.0008 0.0006 0.0014 4.2749 8.4077 15.0908 30.1954
frequency: 7.5034 14.6686 30.1517 39.3556 56.0380 56.6711 69.2536 90.6304 111.4228 126.8490 153.2490 180.9934 187.9808 193.8317 212.4927 235.6521 285.0103 302.3558 306.1529 320.5718 379.3481 394.9209 403.8885 415.9378 444.9006 464.1608 471.5189 483.8344 509.9219 542.7981 594.7826 600.1150 612.8456 618.3644 653.7464 670.7732 730.1235 746.9857 751.2593 815.2963 848.7384 949.1181 951.3881 957.4387 962.2042 980.1559 1003.1024 1003.6887 1004.8828 1022.9485 1064.0347 1086.0047 1119.3269 1172.3036 1256.9135 1305.9006 1330.7495 1390.4160 1426.2843 1447.5379 1558.3306 1614.0404 1646.6630 1656.3713 3165.2101 3173.6222 3175.6268 3536.8845 3538.5359
redmass: 15.7313 14.0441 16.8735 17.9775 12.1508 10.5139 16.8876 10.8202 8.7204 9.1913 14.6010 17.8206 4.5760 6.7054 9.9404 7.9654 19.0390 12.5535 19.4265 8.2970 12.7754 19.0413 6.9330 22.4405 3.4176 18.0697 17.1663 9.2484 4.4988 4.8809 5.0740 1.4070 4.1951 1.2497 17.8205 2.8671 3.3572 7.5001 8.4526 17.8195 8.6558 5.4234 1.9273 8.6878 1.5090 6.1193 1.5325 8.9659 13.0298 4.1213 2.3781 1.7510 1.3564 2.1162 1.2243 2.2739 2.5825 8.6982 4.0579 4.1992 7.2707 7.1324 9.6834 9.6123 1.0929 1.0927 1.0941 1.0645 1.0645
irintensity: 0.0865 0.0442 0.3075 0.6802 0.8209 2.4641 0.0565 3.6059 1.7165 0.1029 0.0353 0.1632 0.0137 9.1274 0.2943 1.6282 0.1030 3.1138 2.1486 0.2334 58.5642 99.2612 15.3215 41.8271 0.0457 1.6813 2.5108 0.8736 13.9454 45.8384 80.3132 293.5912 10.6138 4.4068 32.1041 23.9320 72.7721 0.0499 3.1675 46.5887 18.9839 81.2929 15.8856 559.3595 10.8108 0.4113 13.0499 201.9578 192.0963 28.6291 542.6950 25.3541 133.8214 1.0492 5.9373 179.9496 33.3868 1.6721 1.8542 0.0384 35.5846 26.0413 2.5281 454.3679 9.4125 20.9500 10.6901 80.7693 62.9525
temp: 298.150 k
press: 1.00000 atm
elementType: 16 16 9 9 9 8 8 8 8 8 8 6 6 6 6 6 6 6 6 6 1 1 1 1 1
symmnumber: 1
zpe: 356695.2 jmol-1
zpe.correction: 0.135858 hartree
zpe.thermalcorrener: 0.156436 hartree
zpe.thermalcorrenthalpy: 0.157380 hartree
zpe.thermalcorrgfe: 0.081196 hartree
zpe.sumelectzpe: -1891.328301 hartree
zpe.sumelectthermal: -1891.307724 hartree
zpe.sumelectthermalent: -1891.306779 hartree
zpe.sumelectthermalfe: -1891.382964 hartree
dipole: -4.0358 0.1216 -1.0545
dipole: 4.1731
quadrupole: -156.7998 -109.0467 -133.7860
quadrupole: 6.6352 -7.5431 3.2724
quadrupole: -23.5890 24.1641 -0.5752 6.6352 -7.5431 3.2724
hfenergy: -1891.4641594 hartree
pointgroup: C01 [X(C9H5F3O6S2)]
dipole: -1.5922637 -0.1080212 -0.3854624 debye
dipolederiv: 1.7450065 -0.0136356 -0.1751407 -0.0537284 0.797038 -0.0177695 -0.4361625 -0.0792209 1.4613732 -0.7759861 -0.098983 0.2005509 -0.1825056 -0.2052701 0.0918196 0.168504 0.026584 -0.367086 -0.7214585 0.0638984 -0.0900309 0.0833868 -0.3668411 0.1636147 -0.4184389 0.1750063 -0.4593903 -0.9898527 -0.0183466 0.4632989 -0.0884838 -0.2707909 0.0115976 0.3109853 -0.0410433 -0.5263513 -0.5254591 -0.1092899 0.0439651 -0.3169463 -0.823708 0.0167919 -0.121529 -0.1295885 -0.2175374 -0.6002142 0.0164393 0.0125546 0.0790784 -0.4036374 -0.1708565 0.0031597 -0.0372133 -0.5164262 -0.6133991 -0.0036783 0.0303113 -0.0411557 -0.4454545 0.1729898 0.0006716 0.0683316 -0.5012186 -0.3807983 0.318016 -0.0117891 0.1287356 -1.231177 0.1156758 -0.0003401 0.1221548 -0.4104726 -0.4623043 -0.428066 -0.0130705 -0.236902 -1.1292433 -0.0851098 -0.009676 -0.0892112 -0.3996686 -0.997928 -0.0845409 -0.148685 -0.2912911 -0.6820244 -0.0302427 -0.1714559 -0.0056544 -0.3461452 -0.931329 0.101964 -0.1460156 0.3261873 -0.7236876 0.0664566 -0.1808281 0.0434365 -0.3493042 0.2858401 -0.0258302 0.0209961 -0.0563637 -0.2564075 0.0030782 0.167041 0.0010851 -0.1876409 -0.2144456 -0.0478214 0.0235367 -0.2591328 0.0160095 -0.0348517 -0.0056269 0.0015671 -0.0197855 -0.158273 0.0642493 0.0287998 0.3110648 -0.0163798 0.0291966 -0.000623 -0.0000736 -0.0279158 -0.2053702 0.0462696 -0.0490745 0.2077357 -0.3903399 0.0329789 -0.0904267 0.027007 0.0090847 -0.2549974 -0.0814997 -0.049477 -0.2305864 -0.3681488 -0.0106127 -0.0926059 -0.0056306 0.010762 0.0012749 0.0083259 0.0281499 0.0056295 0.1384698 -0.0046119 0.0121456 -0.0046679 -0.0383182 1.25241 0.09338 0.2471728 0.4672101 1.8302216 -0.0328831 0.2472604 -0.0440272 0.3075194 1.1792242 0.0253601 0.2478609 -0.3699169 1.8485611 -0.0644626 0.2644237 -0.0571336 0.3079046 2.5532923 0.1458195 -0.504977 0.4958009 1.4948883 -0.2661239 0.4450399 0.0149796 1.0750178 0.168083 -0.0501611 -0.0121754 -0.0441919 0.1620653 0.0072939 0.0192996 -0.0193824 0.1354187 0.189404 0.0527396 -0.0171578 0.0392581 0.1565331 -0.005785 0.0173325 0.0207566 0.1375526 0.0953108 0.0054491 -0.0171115 0.0047302 0.1691098 0.0009395 -0.0077027 0.000547 0.1477965 0.1684356 -0.1147338 -0.0552376 -0.0331006 0.3640337 -0.0150525 -0.0621836 -0.0293902 0.3890617 0.193534 0.1346756 -0.0572543 0.0554878 0.33618 0.0259288 -0.058264 0.0407811 0.3857696 unknown
polarizability: 242.5039354|8.0433234|185.4819271|-0.0286925|-5.2057415|120.0131402 unknown
InChI: InChI=1S/C8H5O6S.CF3S/c9-7(10)4-1-5(8(11)12)3-6(2-4)15(13)14;2-1(3,4)5/h1-3,9,11H;
charge 0 multiplicity 1
25 atoms
S  1.656395 -0.307094 1.07276
S  2.69205 -0.297317 -1.256596
F  4.902396 -0.309586 0.356522
F  5.254829 0.194745 -1.836287
F  4.349233 1.731925 -0.438126
O  2.07171 1.06789 1.827851
O  1.883508 -1.762819 1.749744
O  -2.372971 -3.65449 0.052195
O  -1.822869 3.567128 -0.097722
O  -4.287515 -2.464773 -0.529545
O  -3.896928 2.657803 -0.637191
C  -0.149707 -0.180707 0.520153
C  -0.677781 1.101015 0.319313
C  -0.865937 -1.374881 0.370248
C  -2.041207 1.183342 -0.061116
C  -2.227526 -1.265353 -0.012069
C  -2.807693 0.006066 -0.228294
C  -3.082466 -2.478267 -0.195458
C  -2.703027 2.503133 -0.298547
C  4.359711 0.360109 -0.759598
H  -0.081754 2.007148 0.462388
H  -0.412639 -2.353483 0.554189
H  -3.859653 0.07976 -0.52409
H  -2.966618 -4.442206 -0.074903
H  -2.28914 4.430009 -0.26222
