program: Gaussian 09
title: 000276670
version: EM64L-G09RevD.01
frameworkgroup: C1[X(C17H16ClN3O3)]
method: RPBEPBE
basis: SDD
operation: Freq
keyword: #p
keyword: freq=noraman
keyword: PBEPBE/SDD
title: #p freq=noraman PBEPBE/SDD
converged: YES YES NO NO
title: Mulliken charges:
elementType: Cl O O O N N N C C C C C C C C C C C C C C C C C H H H H H H H H H H H H H H H H
charge: -0.040540 -0.263490 -0.258004 -0.234053 -0.481174 -0.190567 0.035354 -0.701715 0.314490 0.303605 0.202375 0.188035 -0.570878 -0.390190 -0.579455 -0.375338 0.516057 -0.485920 0.329957 -0.363744 0.298463 -0.333729 -0.535788 -0.569400 0.248670 0.248486 0.308224 0.242470 0.255595 0.240459 0.229831 0.251281 0.350807 0.276392 0.271561 0.221667 0.247154 0.221783 0.281248 0.290021
chargesum: 0.00000
title: Mulliken charges with hydrogens summed into heavy atoms:
elementType: Cl O O O N N N C C C C C C C C C C C C C C C C C
charge: -0.040540 -0.263490 -0.258004 -0.234053 -0.130367 -0.190567 0.035354 -0.204559 0.314490 0.303605 0.202375 0.188035 -0.262654 -0.147719 -0.323861 -0.134879 0.516057 -0.256089 0.329957 -0.112463 0.298463 0.214224 0.154816 0.001869
polarizability: 5.19887189e+02 2.44499225e+01 2.35218692e+02 -1.14727291e+01 1.41860857e+01 1.07387804e+02
1716.lowfreq: -4.5816 -0.0010 0.0008 0.0010 0.5447 6.6463 21.0312 24.5073 27.9639
frequency: 20.9331 24.0325 27.9563 53.2881 57.0794 69.1274 73.5792 107.9527 130.0699 137.1837 147.5951 163.1468 180.9878 200.4333 223.8695 233.3913 240.5083 253.8897 295.0363 322.4402 351.0334 357.8277 395.6358 403.5498 426.1106 440.9241 443.0278 465.6960 474.0834 523.1412 541.8758 545.2838 580.3312 604.7366 632.2601 680.3169 700.1314 709.2862 713.3475 723.6681 746.4363 761.4159 774.8242 786.5224 798.1599 828.3796 839.6866 848.4468 849.4526 899.2785 910.6985 919.8573 941.8636 949.7430 956.0346 969.7591 983.7429 1003.4998 1043.4898 1051.4379 1086.9260 1098.8968 1111.7504 1133.9359 1134.4940 1147.1954 1156.7154 1164.1899 1203.5951 1208.6423 1215.1497 1233.9338 1249.0652 1267.7470 1280.7878 1293.9767 1312.7261 1326.7048 1359.4249 1369.6466 1377.8019 1379.4013 1424.7492 1429.2517 1436.0180 1451.2959 1455.0100 1455.3667 1466.0223 1466.5984 1475.6123 1494.8474 1524.0299 1589.8259 1594.7743 1621.8094 1628.1903 1655.9510 2958.6134 2985.2060 3029.7614 3046.2252 3046.9343 3070.8453 3119.6255 3123.1224 3125.6388 3134.8667 3148.9596 3151.0177 3160.1986 3169.1392 3180.4135 3438.7877
redmass: 7.4870 5.3040 9.1622 5.8231 3.1494 4.6513 5.1162 5.2454 6.9468 6.0401 4.0393 7.7064 2.9963 6.7275 3.8685 2.0420 2.0935 3.6078 4.0713 3.2236 5.5151 6.6971 5.6126 6.0142 2.7165 4.1504 3.8639 6.6787 9.2504 4.1240 3.0603 6.4761 5.8262 2.9289 6.6025 7.2259 6.2147 5.7222 3.2143 3.4773 2.7471 2.8586 3.3083 1.3125 2.9309 1.4383 1.5234 5.0264 1.4775 4.3260 1.5326 2.8305 3.5024 1.4027 1.3883 1.8887 5.7088 5.3039 1.9925 2.7251 2.8833 2.0982 1.2604 1.1522 1.8653 1.4110 1.4415 1.7084 1.6621 2.0014 2.0069 2.4689 2.6059 1.1649 1.6545 1.5816 3.2556 1.2441 1.3921 5.8445 4.2888 5.9724 1.2453 1.3451 1.1146 2.8317 1.8319 1.6567 1.6074 1.1652 1.2479 3.9894 1.9248 7.8195 5.7334 6.9863 6.9353 9.1810 1.0330 1.0609 1.0993 1.1039 1.0595 1.0557 1.0883 1.1045 1.0993 1.0895 1.0961 1.0911 1.1128 1.0955 1.0931 1.0763
irintensity: 0.0604 0.1715 0.1312 0.2023 1.0534 5.3187 0.8917 0.0911 12.4341 7.4244 0.5679 3.8727 0.3789 4.0767 0.7999 3.3727 9.6107 1.7531 0.5671 2.3594 5.8079 67.7339 1.4854 4.5554 10.8624 3.3063 3.4981 7.3470 7.4384 4.3042 6.3466 7.5898 7.5630 0.7318 7.7835 11.5015 74.7326 1.6584 9.2205 3.6793 6.4149 3.0120 36.5649 16.0060 94.2326 95.6473 64.3280 24.9130 18.2763 6.3910 2.5983 155.0111 4.3180 3.8018 3.2795 22.6115 37.7329 22.1652 80.7464 10.5072 68.4437 20.1577 0.2059 0.4316 47.2072 28.1521 23.6333 0.6004 3.9520 7.9269 96.6152 28.3801 117.1440 7.1942 39.6411 5.9427 70.6078 28.0784 33.6953 268.3749 22.3760 10.9528 24.6489 49.3521 29.1430 32.9964 15.7333 16.7623 188.4728 61.4739 2.3417 53.7275 312.2955 20.0984 25.8201 223.8319 1.7464 303.5324 82.9679 11.2086 6.1624 49.0488 2.3968 13.1455 16.8422 1.2089 30.6035 7.3558 15.8418 11.9306 2.6295 13.6352 2.0963 59.6007
temp: 298.150 k
press: 1.00000 atm
elementType: 17 8 8 8 7 7 7 6 6 6 6 6 6 6 6 6 6 6 6 6 6 6 6 6 1 1 1 1 1 1 1 1 1 1 1 1 1 1 1 1
symmnumber: 1
zpe: 793775.6 jmol-1
zpe.correction: 0.302333 hartree
zpe.thermalcorrener: 0.324253 hartree
zpe.thermalcorrenthalpy: 0.325197 hartree
zpe.thermalcorrgfe: 0.248457 hartree
zpe.sumelectzpe: -1505.644755 hartree
zpe.sumelectthermal: -1505.622836 hartree
zpe.sumelectthermalent: -1505.621891 hartree
zpe.sumelectthermalfe: -1505.698631 hartree
dipole: -3.9804 -0.7203 0.0413
dipole: 4.0452
quadrupole: -161.2815 -138.8408 -147.8541
quadrupole: 16.3773 1.5785 2.3740
quadrupole: -11.9560 10.4846 1.4714 16.3773 1.5785 2.3740
hfenergy: -1505.9470882 hartree
pointgroup: C01 [X(C17H16Cl1N3O3)]
dipole: -1.5746619 -0.2310224 0.0022683 debye
polarizability: 521.3806085|14.7043612|234.1584375|-6.9119171|13.5794729|106.9546393 unknown
InChI: InChI=1S/C17H16ClN3O3/c1-24-14-3-5-16-12(10-14)8-11-9-13(2-4-15(11)16)19-17(22)21(20-23)7-6-18/h2-5,9-10,19H,6-8H2,1H3
charge 0 multiplicity 1
40 atoms
Cl 7.710205 -2.645209 0.521513
O  -7.116411 -0.733881 0.057877
O  3.136147 -1.432787 -0.421229
O  6.325591 1.872186 -0.060531
N  2.549605 0.842706 -0.10299
N  4.818082 0.20241 -0.277559
N  5.0869 1.56271 -0.081795
C  -2.043448 -1.440781 -0.239684
C  -1.020761 -0.316119 -0.119805
C  -3.373675 -0.711153 -0.082899
C  -1.693284 0.928349 0.084306
C  -3.1438 0.683536 0.106945
C  0.376904 -0.396509 -0.187992
C  -0.940554 2.11632 0.223026
C  -4.676107 -1.240934 -0.108082
C  -4.240357 1.563398 0.274735
C  1.125914 0.805588 -0.047524
C  0.464997 2.049399 0.156367
C  -5.766925 -0.346763 0.061366
C  -5.547837 1.045341 0.251208
C  3.413338 -0.210769 -0.275744
C  5.882746 -0.804961 -0.483438
C  -7.415866 -2.155054 -0.128859
C  6.350542 -1.387182 0.860958
H  -1.967923 -1.961171 -1.214563
H  -1.89862 -2.212534 0.541578
H  0.895408 -1.344717 -0.344464
H  -1.43155 3.082459 0.380517
H  -4.83677 -2.313392 -0.254882
H  -4.085364 2.637942 0.42159
H  1.059254 2.965672 0.262303
H  -6.421803 1.691424 0.376846
H  3.005203 1.759102 -0.000251
H  5.46881 -1.603086 -1.117757
H  6.722159 -0.302341 -0.992911
H  -7.047199 -2.519625 -1.107611
H  -8.513005 -2.224179 -0.097578
H  -6.980309 -2.768684 0.68384
H  6.799714 -0.625978 1.514461
H  5.548049 -1.938033 1.37131
