program: Gaussian 09
title: 000276666
version: EM64L-G09RevD.01
frameworkgroup: C1[X(C9H15IN3O7P)]
method: RPBEPBE
basis: SDD
operation: Freq
keyword: #p
keyword: freq=noraman
keyword: PBEPBE/SDD
title: #p freq=noraman PBEPBE/SDD
converged: NO YES NO NO
title: Mulliken charges:
elementType: I P O O O O O O O N N N C C C C C C C C C H H H H H H H H H H H H H H H
charge: -0.036415 1.373860 -0.259737 -0.531325 -0.500536 -0.291904 -0.685740 -0.724090 -0.585138 -0.104782 -0.036123 -0.583582 -0.070900 -0.134432 -0.517952 0.034078 -0.379395 -0.474654 -0.536817 0.151984 0.221537 0.273064 0.282682 0.253224 0.279410 0.254297 0.249469 0.236336 0.355222 0.269805 0.284045 0.403347 0.338339 0.354635 0.393930 0.444258
chargesum: 0.00000
title: Mulliken charges with hydrogens summed into heavy atoms:
elementType: I P O O O O O O O N N N C C C C C C C C C
charge: -0.036415 1.373860 -0.259737 -0.127978 -0.500536 -0.291904 -0.291811 -0.279832 -0.585138 -0.104782 -0.036123 0.109391 0.202164 0.148250 0.014682 0.288375 0.106410 -0.119432 0.017033 0.151984 0.221537
polarizability: 2.73256267e+02 8.55871779e+00 1.75603854e+02 6.28031142e+00 -6.55769871e+00 1.38221584e+02
1716.lowfreq: -6.2977 0.0012 0.0013 0.0013 2.4387 9.0966 15.1248 23.1764 40.2549
frequency: 14.6513 21.9675 40.2091 54.7954 63.7350 75.1622 80.2263 107.9787 125.8785 144.5163 169.8858 187.9751 203.9554 211.0222 235.1781 242.5374 269.7709 305.0935 315.7570 343.7490 349.4032 354.5772 366.9793 369.8567 400.2290 420.2602 449.8278 460.2861 476.8968 506.6601 523.7971 552.3610 557.1655 585.9162 614.7147 624.3298 670.6114 693.3035 698.3602 721.4111 736.8661 760.0976 791.8241 810.0211 817.6462 872.6311 886.8526 909.7293 936.7422 961.4021 963.7069 978.3650 990.0163 1011.5789 1018.2189 1043.8568 1062.7791 1076.9074 1082.3444 1086.9215 1102.8583 1110.4091 1132.5603 1179.6322 1190.3503 1197.6575 1225.0096 1239.6980 1242.7262 1252.4551 1265.5069 1285.1519 1297.8910 1304.0528 1308.6626 1346.1662 1350.5632 1366.2335 1410.3637 1418.2647 1432.1023 1447.0494 1461.2438 1462.6536 1591.9523 1595.6478 1650.3382 2580.2700 2976.8172 2989.1115 3019.2272 3041.9208 3058.1305 3079.0391 3098.9553 3103.6204 3118.3449 3125.0341 3253.5337 3523.0667 3606.8908 3679.3611
redmass: 8.6992 9.9597 6.9902 6.9437 7.9221 9.1841 9.3811 2.6591 2.8019 4.5022 4.4541 7.6052 5.8733 7.0758 4.5107 3.7040 5.4869 3.9743 4.7910 3.8197 6.3470 3.8324 4.5495 6.0136 5.5786 5.9251 4.8617 2.1281 2.5013 2.2571 1.9792 7.0680 4.8033 4.1768 4.7107 7.6243 1.5375 4.1013 8.6592 7.0816 7.3669 5.2368 2.2344 2.2659 2.0856 3.4865 2.9041 2.5027 3.8446 2.4461 6.4026 3.9637 2.3513 1.7462 1.4726 2.7641 1.9688 2.4900 6.0934 3.1624 1.2824 1.5555 2.0691 1.2504 1.4440 1.1788 2.0095 1.5741 1.2053 1.5785 1.3793 1.2236 1.4077 1.4143 1.5046 1.3023 1.5474 1.4588 1.4990 1.2184 1.0896 3.1535 1.0985 1.0837 1.9955 7.5149 2.2757 1.0807 1.0678 1.0841 1.0608 1.0686 1.0844 1.0873 1.1056 1.0936 1.1013 1.0901 1.0668 1.0468 1.0661 1.1037
irintensity: 2.5758 1.2519 3.2686 13.7659 5.1597 2.2843 4.4735 37.0968 31.3143 7.0774 4.0132 0.9913 23.7663 4.4540 40.4188 13.5940 23.3213 5.4492 2.2601 79.9288 18.1931 18.8321 17.6962 5.1429 29.7133 91.4461 9.8032 20.9843 63.5506 43.5424 96.7211 10.1070 9.8645 74.3920 19.4356 9.0029 118.5520 31.3644 252.3758 5.1232 18.4986 27.4048 33.2442 178.1209 32.6077 55.4635 10.5936 16.6420 116.1127 7.3552 43.3503 166.7285 110.8703 8.8298 87.3983 30.8706 124.0282 36.1409 63.5427 218.3717 306.5690 64.7960 39.2861 259.3564 144.0153 1.7679 185.4920 137.7117 82.3132 6.4655 80.4918 19.0692 7.9102 7.5445 20.5450 15.3528 32.9490 7.7602 71.3429 290.9658 27.3254 20.9464 50.8186 12.8597 49.6642 884.6660 340.9600 2396.3945 3.1796 8.8487 23.1652 4.0549 10.1999 41.5197 8.9011 5.6831 10.4136 0.7135 661.7631 127.1351 56.0821 52.0268
temp: 298.150 k
press: 1.00000 atm
elementType: 53 15 8 8 8 8 8 8 8 7 7 7 6 6 6 6 6 6 6 6 6 1 1 1 1 1 1 1 1 1 1 1 1 1 1 1
symmnumber: 1
zpe: 691023.0 jmol-1
zpe.correction: 0.263197 hartree
zpe.thermalcorrener: 0.284678 hartree
zpe.thermalcorrenthalpy: 0.285622 hartree
zpe.thermalcorrgfe: 0.209746 hartree
zpe.sumelectzpe: -1393.893918 hartree
zpe.sumelectthermal: -1393.872437 hartree
zpe.sumelectthermalent: -1393.871492 hartree
zpe.sumelectthermalfe: -1393.947368 hartree
dipole: -11.3379 -0.8333 -1.8465
dipole: 11.5175
quadrupole: -169.4740 -138.3005 -148.7993
quadrupole: -43.7809 18.7633 -9.3412
quadrupole: -17.2828 13.8908 3.3920 -43.7809 18.7633 -9.3412
hfenergy: -1394.1571148 hartree
pointgroup: C01 [X(C9H15I1N3O7P1)]
dipole: 4.2497849 1.2752992 0.9197228 debye
polarizability: 264.5108659|21.9490518|140.8084621|22.4561774|7.7342578|181.7623772 unknown
InChI: InChI=1S/C9H15IN3O7P/c10-6-2-7(11)12-9(15)13(6)8-1-4(14)5(20-8)3-19-21(16,17)18/h4-6,8,14,16-17H,1-3,11H2
charge 0 multiplicity 1
36 atoms
I  4.460842 0.727276 1.870373
P  -4.554759 -0.360998 -1.179448
O  -0.302867 1.214146 0.925999
O  -1.491304 -2.059904 -0.102317
O  -3.374639 0.90532 -1.072129
O  0.924219 -1.604707 -1.006819
O  -5.670454 0.215973 0.008438
O  -3.958142 -1.724477 -0.38264
O  -5.0882 -0.520634 -2.656474
N  1.807908 0.205566 0.209568
N  3.064115 -0.897911 -1.547048
N  5.055093 0.018621 -2.316178
C  0.764717 0.269865 1.284377
C  -1.317167 -0.983017 0.879425
C  0.039287 -1.043957 1.643297
C  -1.325421 0.418851 0.188161
C  -2.649081 1.197665 0.184724
C  2.792749 1.232971 0.282258
C  3.500998 1.491939 -1.049067
C  1.885739 -0.803826 -0.80684
C  3.878208 0.145689 -1.642672
H  1.278845 0.713373 2.153474
H  -2.167558 -1.093816 1.569495
H  -0.137949 -1.035232 2.731239
H  0.609318 -1.952287 1.399561
H  -1.003872 0.303127 -0.867253
H  -2.440402 2.278944 0.140218
H  -3.280085 0.98051 1.066171
H  2.392284 2.144886 0.742969
H  4.363598 2.159647 -0.907203
H  2.783405 1.993049 -1.732514
H  -0.645462 -2.095803 -0.649912
H  5.725959 0.781202 -2.374326
H  5.286841 -0.889616 -2.721613
H  -6.369916 -0.437228 0.261765
H  -2.949943 -2.005709 -0.45266
