program: Gaussian 09
title: 000276576
version: EM64L-G09RevD.01
frameworkgroup: C1[X(C12H20O2)]
method: RPBEPBE
basis: SDD
operation: Freq
keyword: #pfreq=noraman
keyword: PBEPBE/SDD
title: #p freq=noraman PBEPBE/SDD
converged: YES YES NO NO
title: Mulliken charges:
elementType: O O C C C C C C C C C C C C H H H H H H H H H H H H H H H H H H H H
charge: -0.293760 -0.250791 0.409860 0.102415 -0.620927 -0.486189 -0.498858 -0.745981 -0.410362 -0.410925 0.202917 -0.390698 -0.259978 -0.667287 0.260172 0.228565 0.203056 0.191124 0.234889 0.192454 0.201474 0.229176 0.238186 0.199511 0.202378 0.202773 0.198572 0.204451 0.190854 0.235632 0.218075 0.216479 0.220022 0.252722
chargesum: 0.00000
title: Mulliken charges with hydrogens summed into heavy atoms:
elementType: O O C C C C C C C C C C C C
charge: -0.293760 -0.250791 0.409860 0.102415 -0.132191 -0.092010 -0.071515 -0.077145 -0.008472 -0.009581 0.202917 0.004608 0.193729 0.021937
polarizability: 1.55796422e+02 -1.40513595e-01 1.31771990e+02 -1.93149951e+00 -2.86592027e+00 1.09570092e+02
1716.lowfreq: -11.3812 -4.6533 -0.0005 -0.0005 -0.0004 11.1930 32.1128 56.2226 73.5832
frequency: 29.3626 56.1868 73.5584 92.1790 102.9086 126.3763 153.5967 198.2906 216.1893 240.1223 255.0188 287.4713 302.2147 335.8306 366.5088 390.5237 414.0307 446.1800 453.9892 477.3334 497.9909 582.9901 668.9646 723.4292 739.0317 788.5582 792.4886 816.2590 829.9646 839.3456 856.9110 883.5424 900.3422 924.7455 932.5728 960.9233 979.9630 1014.2107 1023.1810 1047.5499 1071.0830 1074.6674 1084.7350 1095.6456 1098.8565 1104.2804 1147.0923 1150.0452 1158.2269 1233.3636 1237.8453 1254.6135 1268.6547 1278.7571 1301.0244 1323.6942 1330.2867 1334.3850 1339.1777 1341.8228 1355.1661 1385.9910 1387.6231 1398.1454 1446.5544 1454.7280 1457.2373 1459.8434 1462.3198 1463.8744 1468.0216 1469.3294 1476.5346 1478.3530 1485.5709 1610.0482 2961.8464 2965.3193 2968.9418 2970.8792 2971.2010 2990.8668 2994.9107 3026.4480 3026.8221 3029.8458 3039.7345 3051.0751 3072.2679 3081.3549 3083.6651 3085.7397 3090.9121 3105.0196 3116.1905 3195.4362
redmass: 3.0523 3.4823 3.9407 2.4950 2.6796 1.3876 2.8742 1.6685 2.1066 1.7835 2.5874 2.0302 2.6911 3.3214 2.8121 2.0887 2.4828 2.5651 2.6553 3.4951 2.2590 3.7561 2.8538 3.2350 5.3491 1.4744 1.9420 1.8217 3.4312 2.7036 1.6138 1.5871 2.2808 1.6959 1.3731 1.4840 2.5098 2.7997 1.7152 1.5933 1.7212 1.7023 2.1674 1.7887 1.8651 1.5248 1.4234 1.9210 2.0880 2.2776 1.7177 1.3315 1.4516 1.1152 1.9485 1.5502 1.3743 1.8041 1.4839 1.4841 1.3247 1.7342 1.2754 1.2550 1.2262 1.0966 1.0889 1.0856 1.0511 1.0821 1.0835 1.0697 1.0748 1.0838 1.0564 9.1715 1.0681 1.0614 1.0668 1.0606 1.0617 1.0361 1.0369 1.0668 1.0881 1.1004 1.1018 1.0979 1.0936 1.0984 1.0979 1.0584 1.1028 1.0989 1.1054 1.1137
irintensity: 0.2757 1.5978 0.8946 0.1223 0.0655 0.2577 2.5745 2.8060 0.6671 1.1646 0.2795 0.3353 1.3923 14.4893 1.0485 1.1720 0.6622 1.3139 4.4538 5.7996 1.6558 0.6419 2.4996 9.1435 3.9482 0.3651 37.1328 9.5198 5.6500 1.3165 3.5309 3.7736 9.5211 2.0068 5.8525 9.1830 21.9037 40.6713 2.9003 28.4240 5.7331 41.3571 175.6587 12.8241 14.9242 73.3626 6.1293 18.5416 11.6589 20.6833 2.7365 1.8561 25.3037 2.2153 30.3028 0.6063 1.1844 2.9873 0.6954 0.1119 1.8565 12.6258 22.6409 14.2412 12.3489 19.9956 4.1557 9.1987 19.2551 8.3308 21.0467 7.9698 12.5728 2.9906 12.6181 230.0069 18.3942 34.8216 22.2562 37.7621 42.7352 19.7323 27.0609 72.5704 40.9350 53.8100 66.4439 49.5616 15.7764 23.7273 41.8687 13.6953 5.0343 26.0623 30.7803 6.1419
temp: 298.150 k
press: 1.00000 atm
elementType: 8 8 6 6 6 6 6 6 6 6 6 6 6 6 1 1 1 1 1 1 1 1 1 1 1 1 1 1 1 1 1 1 1 1
symmnumber: 1
zpe: 778391.6 jmol-1
zpe.correction: 0.296474 hartree
zpe.thermalcorrener: 0.311625 hartree
zpe.thermalcorrenthalpy: 0.312569 hartree
zpe.thermalcorrgfe: 0.254072 hartree
zpe.sumelectzpe: -618.591726 hartree
zpe.sumelectthermal: -618.576575 hartree
zpe.sumelectthermalent: -618.575630 hartree
zpe.sumelectthermalfe: -618.634127 hartree
dipole: -1.1087 -1.4354 1.0702
dipole: 2.1059
quadrupole: -82.5978 -84.4842 -87.8342
quadrupole: -7.8906 4.2781 2.5018
quadrupole: 2.3743 0.4879 -2.8621 -7.8906 4.2781 2.5018
hfenergy: -618.8881994 hartree
pointgroup: C01 [X(C12H20O2)]
dipole: 0.3718145 -0.3352037 -0.660184 debye
polarizability: 154.8660561|2.5246839|125.9388121|-6.2168854|9.9567419|116.3336358 unknown
InChI: InChI=1S/C12H20O2/c1-3-14-10(13)11(2)9-12(11)7-5-4-6-8-12/h3-9H2,1-2H3
charge 0 multiplicity 1
34 atoms
O  -2.198814 0.152142 -0.653375
O  -2.374524 0.807043 1.574967
C  0.863137 0.517882 -0.111269
C  -0.363707 1.416998 0.327509
C  0.247099 1.516966 -1.089788
C  2.244603 0.824323 0.485206
C  0.674581 -0.985707 -0.355707
C  -0.159032 2.552737 1.332422
C  3.370872 0.269365 -0.426007
C  1.798219 -1.544368 -1.26561
C  -1.708703 0.775237 0.508719
C  3.198167 -1.245414 -0.682334
C  -3.532943 -0.509828 -0.53199
C  -3.403575 -1.927197 0.035262
H  -0.351985 1.130763 -1.918762
H  0.801763 2.43631 -1.310847
H  2.322497 0.354104 1.487712
H  2.393389 1.90976 0.625905
H  -0.311075 -1.186098 -0.807329
H  0.705422 -1.514119 0.620971
H  0.783208 3.093214 1.147399
H  -0.986055 3.281596 1.256749
H  -0.151249 2.170789 2.367939
H  4.35644 0.473503 0.035802
H  3.349337 0.807044 -1.396119
H  1.714828 -1.082697 -2.270851
H  1.660708 -2.635042 -1.399285
H  3.988137 -1.611213 -1.366601
H  3.321114 -1.794432 0.274559
H  -4.175601 0.1169 0.111039
H  -3.913931 -0.511087 -1.566178
H  -4.394745 -2.418182 0.037927
H  -2.71857 -2.53963 -0.576922
H  -3.031114 -1.898863 1.072687
