program: Gaussian 09
title: 000276581
version: EM64L-G09RevD.01
frameworkgroup: C1[X(C14H12O2S)]
method: RPBEPBE
basis: SDD
operation: Freq
keyword: #p
keyword: freq=noraman
keyword: PBEPBE/SDD
title: #p freq=noraman PBEPBE/SDD
converged: YES YES NO NO
title: Mulliken charges:
elementType: S O O C C C C C C C C C C C C C C H H H H H H H H H H H H
charge: 0.285562 -0.176434 -0.196004 -0.314630 0.398069 -0.176095 0.446757 0.289039 -0.349586 0.059331 -0.469459 -0.188489 -0.236198 -0.378743 -0.366354 -0.770675 -0.802891 0.284972 0.269706 0.249213 0.251984 0.234023 0.234256 0.252691 0.253546 0.223203 0.227321 0.240150 0.225738
chargesum: 0.00000
title: Mulliken charges with hydrogens summed into heavy atoms:
elementType: S O O C C C C C C C C C C C C C C
charge: 0.285562 -0.176434 -0.196004 -0.314630 0.398069 -0.176095 0.446757 0.289039 -0.064613 0.059331 -0.199753 0.060724 0.015786 -0.144720 -0.132099 -0.041235 -0.109683
polarizability: 3.01422067e+02 1.62372609e+01 1.37769569e+02 -3.27812605e+01 4.25425316e-01 1.32214560e+02
1716.lowfreq: -9.4281 -5.3489 -0.0015 -0.0008 0.0012 7.4805 18.0845 23.6156 29.9190
frequency: 18.0257 23.5840 29.7684 38.6076 68.2852 102.8386 125.4259 142.2334 183.3791 191.1721 231.9781 275.0680 284.3872 330.6500 355.4187 366.2683 380.9004 385.8758 404.8614 415.9265 467.5003 498.9170 580.9260 599.3088 614.1325 630.1881 668.4316 679.8079 708.0519 771.2997 782.8264 786.4804 818.3423 841.9328 879.7614 909.8406 948.4984 953.6439 972.6583 986.0989 999.5132 1000.9956 1043.9166 1046.9370 1073.7306 1117.7875 1131.0256 1188.6895 1194.3687 1220.3484 1227.5108 1295.6402 1301.2760 1349.1031 1365.1950 1394.1860 1397.2442 1397.9524 1444.6991 1454.5664 1470.2276 1473.6498 1480.1627 1521.8023 1555.2036 1563.5424 1581.9849 1604.5157 1646.0778 2977.0002 2990.6218 3058.6528 3067.9158 3087.3447 3107.8829 3125.9833 3130.4218 3143.1693 3152.7187 3153.3407 3165.9758
redmass: 4.2027 4.9985 1.0574 4.9431 5.8057 1.1348 4.5820 5.6733 3.6052 6.3507 5.9709 4.4539 3.8337 6.4702 3.2700 6.9557 5.3753 4.5692 2.8765 4.8025 8.8943 3.0439 5.9259 5.4554 5.3028 6.9685 5.5231 4.6257 3.3295 3.2123 3.6050 5.0057 1.3887 1.2500 1.5832 1.5304 2.4371 1.8863 1.3873 1.4074 1.6210 4.3451 1.5730 1.5722 2.8136 1.3074 3.4740 1.1352 2.2848 3.0056 2.0126 1.3227 2.1468 2.8655 5.0114 3.2961 1.2248 1.2627 1.0453 1.0877 1.0864 1.0580 2.4706 11.0179 10.0363 7.9084 6.5113 6.2435 6.9248 1.0386 1.0369 1.0951 1.0954 1.0999 1.1010 1.0883 1.0893 1.0928 1.0962 1.0928 1.0962
irintensity: 0.1482 0.1468 0.6108 0.8701 6.5263 0.4768 1.9561 2.1369 0.6337 0.9573 3.2408 0.4666 1.4322 0.3285 1.9007 0.8566 19.4451 12.5626 0.7311 2.2745 4.3479 26.8648 4.4205 0.8327 5.7552 0.2745 4.4131 4.8057 0.9846 11.7310 7.6280 6.2235 49.2041 0.7862 2.5963 48.4361 43.0053 30.6134 0.3693 0.1988 19.4022 18.5972 9.2197 17.2637 1.1356 15.0500 88.3798 13.6431 38.6948 5.8318 53.8690 2.2906 13.9259 31.8640 1.5639 3.5730 12.7907 41.3086 14.1389 8.5344 11.9091 13.7480 53.3239 67.0066 262.7822 227.6454 5.3776 2.9255 7.3148 34.7650 6.8033 23.1991 7.4382 16.9149 14.1469 11.5253 20.8606 7.0204 10.2801 0.5420 4.1729
temp: 298.150 k
press: 1.00000 atm
elementType: 16 8 8 6 6 6 6 6 6 6 6 6 6 6 6 6 6 1 1 1 1 1 1 1 1 1 1 1 1
symmnumber: 1
zpe: 569160.4 jmol-1
zpe.correction: 0.216782 hartree
zpe.thermalcorrener: 0.233433 hartree
zpe.thermalcorrenthalpy: 0.234377 hartree
zpe.thermalcorrgfe: 0.169198 hartree
zpe.sumelectzpe: -1087.970170 hartree
zpe.sumelectthermal: -1087.953518 hartree
zpe.sumelectthermalent: -1087.952574 hartree
zpe.sumelectthermalfe: -1088.017754 hartree
dipole: 1.9135 2.2953 0.4738
dipole: 3.0257
quadrupole: -99.6745 -104.4079 -106.1758
quadrupole: -5.5777 6.2686 4.1108
quadrupole: 3.7449 -0.9885 -2.7564 -5.5777 6.2686 4.1108
hfenergy: -1088.1869517 hartree
pointgroup: C01 [X(C14H12O2S1)]
dipole: 0.7275653 -0.301677 0.8925565 debye
polarizability: 294.029953|39.9477279|137.1297628|30.5354788|2.1857013|140.2464796 unknown
InChI: InChI=1S/C14H12O2S/c1-9-3-5-11(6-4-9)17-14-8-12(15)10(2)7-13(14)16/h3-8H,1-2H3
charge 0 multiplicity 1
29 atoms
S  0.294479 0.733304 -1.889703
O  -0.337593 1.388688 1.11996
O  -4.40159 -1.33093 -1.291483
C  -1.135967 0.24137 -0.874808
C  -3.4971 -0.393201 0.747154
C  1.73935 0.324519 -0.803291
C  4.056127 -0.31271 0.711005
C  -1.224937 0.666925 0.570767
C  -2.202188 -0.392886 -1.466203
C  -3.430659 -0.733274 -0.718813
C  -2.433463 0.249861 1.32464
C  1.992923 -1.016576 -0.443058
C  2.632004 1.34976 -0.428017
C  3.142146 -1.324601 0.318853
C  3.785652 1.024294 0.317234
C  -4.748054 -0.783426 1.489309
C  5.276768 -0.645616 1.55053
H  -2.181417 -0.698002 -2.518016
H  -2.433523 0.525737 2.385593
H  1.309162 -1.81156 -0.759429
H  2.417445 2.38854 -0.696114
H  3.334317 -2.366521 0.60173
H  4.478148 1.823081 0.608331
H  -4.923251 -1.871726 1.407708
H  -5.633596 -0.303343 1.033857
H  -4.693213 -0.503323 2.553658
H  6.127661 0.015919 1.310282
H  5.059352 -0.520734 2.629175
H  5.601216 -1.689971 1.399646
