program: Gaussian 09
title: 000276544
version: EM64L-G09RevD.01
frameworkgroup: C1[X(C16H11Br2N)]
method: RPBEPBE
basis: SDD
operation: Freq
keyword: #p
keyword: freq=noraman
keyword: PBEPBE/SDD
title: #p freq=noraman PBEPBE/SDD
converged: NO YES NO YES
title: Mulliken charges:
elementType: Br Br N C C C C C C C C C C C C C C C C H H H H H H H H H H H
charge: 0.002361 0.002362 -0.677054 0.101911 0.406773 0.342916 -0.423194 -0.455946 -0.414609 0.334525 -0.382396 -0.421225 -0.247781 -0.365235 -0.365252 -0.232423 0.712154 -0.388886 -0.388880 0.258737 0.243075 0.251290 0.235212 0.245790 0.264115 0.264132 0.225968 0.225676 0.322943 0.322943
chargesum: 0.00000
title: Mulliken charges with hydrogens summed into heavy atoms:
elementType: Br Br N C C C C C C C C C C C C C C C C
charge: 0.002361 0.002362 -0.031168 0.101911 0.406773 0.342916 -0.164457 -0.212871 -0.163319 0.334525 -0.147185 -0.175435 -0.021814 -0.101120 -0.101120 -0.006747 0.712154 -0.388886 -0.388880
polarizability: 3.60067335e+02 1.15941287e-02 1.87910326e+02 -7.93491169e+00 6.09898236e-02 1.50055045e+02
1716.lowfreq: -44.2083 -1.3941 -0.8616 -0.0001 0.0003 0.0005 4.9211 30.2749 38.8068
frequency: -44.2029 30.2712 38.8046 81.0211 96.4945 115.2309 149.7564 163.3526 181.8369 197.0415 243.4670 257.0724 280.1587 308.3031 333.6271 388.8637 418.6827 431.1751 455.3028 465.4133 482.3680 515.6201 516.4044 553.0581 559.5152 566.2222 642.9739 648.5497 697.1869 711.2400 730.6687 749.9078 764.6398 778.1915 792.9225 813.0629 851.2475 858.0159 882.3555 885.3600 900.1045 902.8815 942.3402 949.2613 983.6724 1015.9786 1029.7093 1037.7957 1043.1926 1069.8107 1112.8161 1169.1192 1192.3385 1201.6027 1235.4173 1236.3332 1273.6622 1310.1609 1319.8987 1334.4194 1355.5342 1394.3991 1406.4502 1447.4657 1456.7069 1495.2375 1520.8779 1524.6047 1596.0355 1597.2752 1616.4553 1633.6612 1658.8932 3079.4654 3121.0780 3128.7678 3142.9761 3161.9306 3166.1489 3168.9597 3173.2900 3206.4909 3538.2034 3681.5754
redmass: 5.6646 7.4983 6.4782 7.0298 4.6689 12.4056 7.0731 4.5849 10.3786 4.0015 5.0595 11.3640 5.8105 3.4877 5.9008 3.3208 4.3995 2.9783 1.0858 1.2298 4.2173 6.0046 3.0140 4.6065 6.3374 3.3106 6.1607 2.5509 7.6892 5.6739 6.8278 2.8423 1.3291 3.8623 4.7584 1.5265 4.7085 1.6405 2.2266 1.6010 1.3299 3.1441 1.3387 1.4321 1.3345 2.5896 2.6195 1.5503 2.5318 1.7154 1.3619 1.1043 2.1145 1.9105 1.8719 1.3561 1.6182 1.5455 3.5544 4.1875 2.4884 5.9981 3.5219 2.5785 3.7858 4.2772 7.2838 5.2393 2.9046 3.9201 7.2571 1.9463 9.3404 1.0881 1.0862 1.0890 1.0943 1.1001 1.0923 1.0933 1.0899 1.1042 1.0450 1.1042
irintensity: 0.1107 0.1442 0.1752 0.5809 0.3836 0.2086 1.7097 0.0172 2.0347 1.1800 0.4068 2.4467 7.4440 7.5469 7.4098 0.2968 0.2437 8.9828 0.0459 278.5871 0.0000 7.7379 1.6671 0.9740 5.7898 1.6061 9.6202 0.2988 43.7141 1.7114 20.6737 50.4528 76.7080 5.6385 2.9158 23.7447 3.1063 20.1574 22.0904 12.0652 0.5562 8.9619 0.1196 5.1841 0.1742 18.4397 20.0642 78.2889 0.2907 8.7016 0.6052 1.4941 3.3886 12.1883 20.2755 4.6610 13.6010 4.0423 13.6727 27.1876 17.9594 0.0178 10.4292 9.6623 35.7731 229.2278 51.4878 0.4953 23.6111 11.1633 1.7595 241.7940 9.7428 27.6137 4.1506 3.0665 30.2168 42.4822 0.2103 1.2435 4.8755 7.5335 95.0139 50.7377
temp: 298.150 k
press: 1.00000 atm
elementType: 35 35 7 6 6 6 6 6 6 6 6 6 6 6 6 6 6 6 6 1 1 1 1 1 1 1 1 1 1 1
symmnumber: 1
zpe: 575214.7 jmol-1
zpe.correction: 0.219088 hartree
zpe.thermalcorrener: 0.234989 hartree
zpe.thermalcorrenthalpy: 0.235933 hartree
zpe.thermalcorrgfe: 0.173527 hartree
zpe.sumelectzpe: -696.664820 hartree
zpe.sumelectthermal: -696.648919 hartree
zpe.sumelectthermalent: -696.647974 hartree
zpe.sumelectthermalfe: -696.710380 hartree
dipole: -0.7302 0.0000 -0.0004
dipole: 0.7302
quadrupole: -108.4292 -134.5622 -123.3239
quadrupole: -0.0028 -3.3171 0.0087
quadrupole: 13.6759 -12.4571 -1.2188 -0.0028 -3.3171 0.0087
hfenergy: -696.8839075 hartree
pointgroup: C01 [X(C16H11Br2N1)]
dipole: 0.2872709 -0.0000027 -0.0038055 debye
polarizability: 359.8079123|-0.0155497|187.9102956|-10.8340888|-0.0694958|150.3144986 unknown
InChI: InChI=1S/C16H11Br2N/c17-14-8-10(9-15(18)16(14)19)7-12-6-5-11-3-1-2-4-13(11)12/h1-9H,19H2
charge 0 multiplicity 1
30 atoms
Br 4.245601 2.926206 -0.114041
Br 4.246499 -2.926078 -0.113356
N  5.414126 0.000215 -0.366369
C  -2.702105 -0.000326 0.307198
C  -1.239269 -0.000191 0.014975
C  -3.390501 0.000122 -0.951447
C  -1.115985 0.000347 -1.461826
C  -0.216988 -0.000503 0.927864
C  -2.375519 0.000531 -2.0253
C  1.235187 -0.00032 0.573777
C  -3.419947 -0.000783 1.514913
C  -4.798218 0.000111 -0.998862
C  -4.839467 -0.000792 1.465755
C  1.945704 -1.218309 0.413382
C  1.945323 1.217851 0.413077
C  -5.519184 -0.00035 0.22345
C  4.066146 0.000043 -0.064052
C  3.314176 1.203855 0.104266
C  3.314549 -1.203962 0.104556
H  -0.160298 0.000546 -1.988032
H  -0.464688 -0.000898 2.000303
H  -2.606572 0.000911 -3.093411
H  -2.90664 -0.001129 2.483883
H  -5.331518 0.000451 -1.956111
H  1.423699 -2.172493 0.526244
H  1.423019 2.171898 0.525709
H  -5.415015 -0.001146 2.398027
H  -6.614963 -0.000366 0.20773
H  5.911738 0.880309 -0.477658
H  5.912013 -0.879751 -0.477445
