program: Gaussian 09
title: 000276559
version: EM64L-G09RevD.01
frameworkgroup: C1[X(C17H15NO5)]
method: RPBEPBE
basis: SDD
operation: Freq
keyword: #p
keyword: freq=noraman
keyword: PBEPBE/SDD
title: #p freq=noraman PBEPBE/SDD
converged: YES YES NO NO
title: Mulliken charges:
elementType: O O O O O N C C C C C C C C C C C C C C C C C H H H H H H H H H H H H H H H
charge: -0.467442 -0.429601 -0.171241 -0.161303 -0.462204 -0.260810 0.234669 0.339772 -0.203817 -0.380175 -0.475451 -0.099371 0.221475 -0.549064 -0.000286 -0.071473 0.219488 0.272789 -0.479716 -0.365526 -0.373705 -0.206496 -0.208755 0.219005 0.239284 0.284012 0.257081 0.230321 0.269193 0.233022 0.216185 0.371281 0.360632 0.279874 0.279497 0.243547 0.243488 0.351816
chargesum: 0.00000
title: Mulliken charges with hydrogens summed into heavy atoms:
elementType: O O O O O N C C C C C C C C C C C C C C C C C
charge: -0.096161 -0.068969 -0.171241 -0.161303 -0.110388 -0.260810 0.234669 0.339772 0.015188 0.143121 0.011951 -0.099371 0.221475 -0.279871 -0.000286 -0.071473 0.219488 0.272789 -0.030509 -0.085651 -0.094207 0.037051 0.034734
polarizability: 2.84552883e+02 1.60427564e+01 1.94415362e+02 -1.98612874e+01 1.52056595e+01 1.63516223e+02
1716.lowfreq: -12.9361 -3.6657 -3.1229 -0.0008 -0.0007 -0.0004 16.9415 31.0129 56.6904
frequency: 16.8430 30.9353 56.6574 80.3824 90.6052 114.6108 121.7627 143.6413 157.6338 168.8961 180.4641 189.0891 210.9254 222.7457 235.7401 242.4561 294.3065 316.9033 340.1924 354.1563 370.4903 383.9538 415.7787 440.0464 446.4553 494.7781 521.4161 525.3897 551.1244 557.1033 606.8750 627.9037 652.7702 664.5826 679.3900 698.5527 705.9444 710.8810 743.5008 764.3202 796.4269 799.0012 805.5401 850.2720 858.6609 878.8657 896.6902 910.9576 936.8716 945.9313 952.2092 966.3410 974.8112 985.9607 1009.8566 1013.3903 1028.0294 1067.3480 1083.1812 1083.6888 1124.3672 1145.8058 1169.1733 1176.7607 1182.3799 1184.9442 1188.7130 1211.0378 1246.2370 1250.1938 1271.1964 1282.3311 1291.7270 1294.1512 1298.9799 1313.8260 1348.0553 1378.4167 1395.3883 1407.6533 1408.0844 1445.6524 1452.3232 1453.5692 1469.2616 1472.5342 1478.8331 1501.0596 1569.9510 1588.8857 1597.9300 1627.0647 1654.9268 2934.9966 2998.5258 3016.9076 3036.5992 3068.3971 3101.1235 3113.9752 3139.3093 3153.1037 3164.7916 3173.9523 3208.1531 3294.4345 3510.2240 3545.3334
redmass: 6.8469 5.7153 6.5977 4.6844 4.3959 3.5387 5.5128 3.7718 5.7877 4.5771 4.9937 4.0718 4.5424 3.6950 3.4168 6.0082 6.0233 4.0078 4.9957 1.4992 1.4067 3.9929 3.4733 4.1223 4.3790 6.7876 7.2202 11.1687 3.6008 4.1003 4.2327 4.8282 4.8532 4.3935 3.2132 3.9750 2.8791 1.7469 3.4681 2.3585 4.0920 1.5054 2.2588 3.7387 2.1477 4.4586 5.7545 1.4555 2.4586 4.5093 2.0610 3.5904 3.5817 1.4928 2.3226 1.3659 2.9893 3.0865 2.4864 2.4717 1.2516 2.6819 1.4928 1.6529 1.5211 1.8790 1.6202 1.2472 2.6439 1.2884 1.2519 1.7394 1.4091 1.5019 1.6037 1.3831 1.3199 4.9460 2.5918 1.6924 7.1918 3.6848 2.5200 2.5686 1.1431 1.1192 5.1548 1.1490 7.9220 7.5374 7.6613 10.4289 12.6763 1.0838 1.0627 1.0658 1.0614 1.1024 1.1010 1.1035 1.0866 1.0903 1.0956 1.1004 1.0972 1.0682 1.0656 1.0658
irintensity: 2.3139 0.7871 2.7267 1.9652 5.1918 0.7880 3.6067 1.1544 3.8677 3.5924 1.2622 3.5630 7.1390 1.5859 11.5526 4.6120 9.4521 11.4747 13.3390 144.5293 194.1545 17.8133 5.8081 7.5710 0.4197 27.9232 2.1770 3.1443 1.4307 5.1467 11.4895 47.8726 43.7314 3.3916 18.5748 84.2383 49.4749 92.9280 5.4311 60.5982 9.4871 50.9346 12.7423 47.0613 7.3917 25.0928 36.9338 0.2650 8.9346 37.8627 1.3184 17.2376 42.8179 11.9537 2.5032 0.0370 95.6250 7.5882 2.5668 5.4900 16.6344 23.4877 31.1109 0.3504 19.1594 2.3281 17.2009 8.0398 152.0192 13.0684 0.3921 33.7410 16.1292 28.5309 58.4604 32.2995 25.2085 13.8292 93.5493 51.9269 19.0344 4.8399 1.3685 2.1102 5.8789 6.2856 14.0103 6.8827 14.8357 152.4310 0.5078 141.8495 75.6044 65.8713 63.8596 28.9608 23.9366 17.1935 21.8349 12.7959 1.7650 4.7426 3.9418 23.5251 0.7812 193.5800 18.4078 6.9561
temp: 298.150 k
press: 1.00000 atm
elementType: 8 8 8 8 8 7 6 6 6 6 6 6 6 6 6 6 6 6 6 6 6 6 6 1 1 1 1 1 1 1 1 1 1 1 1 1 1 1
symmnumber: 1
zpe: 755534.3 jmol-1
zpe.correction: 0.287768 hartree
zpe.thermalcorrener: 0.307854 hartree
zpe.thermalcorrenthalpy: 0.308798 hartree
zpe.thermalcorrgfe: 0.238420 hartree
zpe.sumelectzpe: -1086.011939 hartree
zpe.sumelectthermal: -1085.991853 hartree
zpe.sumelectthermalent: -1085.990908 hartree
zpe.sumelectthermalfe: -1086.061286 hartree
dipole: 4.6301 2.1283 -0.9626
dipole: 5.1859
quadrupole: -126.1841 -132.4639 -131.5659
quadrupole: 6.7624 -22.4146 -5.1905
quadrupole: 3.8872 -2.3926 -1.4946 6.7624 -22.4146 -5.1905
hfenergy: -1086.2997064 hartree
pointgroup: C01 [X(C17H15N1O5)]
dipole: 1.6099923 -0.2395799 1.2301875 debye
polarizability: 275.7679872|0.0342957|176.6297364|36.1486467|-25.2870371|190.0867437 unknown
InChI: InChI=1S/C17H15NO5/c19-8-9-7-13(18-6-5-12(20)14(9)18)17(23)15(21)10-3-1-2-4-11(10)16(17)22/h1-4,7,12,19-20,23H,5-6,8H2
charge 0 multiplicity 1
38 atoms
O  -4.287273 2.244721 -0.735639
O  0.977964 -1.45324 -2.057137
O  1.594967 1.47599 -1.713046
O  1.329231 -2.753982 0.655425
O  -4.278157 1.132241 1.908109
N  -1.421748 0.252912 -1.181855
C  -2.644707 0.378393 -0.553119
C  -0.532371 -0.448482 -0.358838
C  -3.631726 1.123393 -1.418365
C  -1.423884 0.797613 -2.566168
C  -2.720459 1.667023 -2.566742
C  0.882023 -0.74602 -0.758847
C  -2.567259 -0.215487 0.722036
C  -1.231694 -0.734533 0.839588
C  1.762139 0.543009 -0.890269
C  1.626882 -1.5745 0.335851
C  2.82246 0.475255 0.155736
C  2.752927 -0.756647 0.857866
C  -3.690659 -0.234182 1.718306
C  3.812214 1.431978 0.460141
C  3.674598 -1.066978 1.879562
C  4.73509 1.127135 1.486723
C  4.66669 -0.109042 2.189411
H  -4.410369 0.434677 -1.812639
H  -1.475671 -0.037217 -3.288535
H  -0.502544 1.367444 -2.755875
H  -2.483994 2.713623 -2.309543
H  -3.223816 1.653726 -3.54649
H  -0.821909 -1.278421 1.690218
H  -4.557716 -0.823072 1.373649
H  -3.359115 -0.641237 2.692959
H  -4.527639 1.939088 0.191922
H  0.537841 -2.337028 -1.931619
H  3.857952 2.375289 -0.092888
H  3.614656 -2.022495 2.409788
H  5.518419 1.847653 1.74572
H  5.397284 -0.317661 2.978414
H  -3.564528 1.725964 2.258689
