program: Gaussian 09
title: 000025640
version: EM64L-G09RevD.01
frameworkgroup: C1[X(C10H12O)]
method: RPBEPBE
basis: SDD
operation: Freq
keyword: #pfreq=noraman
keyword: PBEPBE/SDD
title: #p freq=noraman PBEPBE/SDD
converged: YES YES NO NO
title: Mulliken charges:
elementType: O C C C C C C C C C C H H H H H H H H H H H H
charge: -0.435894 0.508469 -0.619070 -0.433842 -0.352095 -0.153229 -0.374783 -0.346361 0.274885 -0.173583 -0.736067 0.210208 0.219045 0.229211 0.242551 0.240713 0.216634 0.247806 0.216523 0.222445 0.221745 0.223692 0.350995
chargesum: 0.00000
title: Mulliken charges with hydrogens summed into heavy atoms:
elementType: O C C C C C C C C C C
charge: -0.084899 0.508469 -0.189816 -0.204630 -0.109545 0.087484 -0.158149 -0.098555 0.274885 0.042941 -0.068185
polarizability: 1.63964229e+02 6.66590902e+00 1.05692553e+02 1.17781741e+01 5.52864068e+00 6.52280092e+01
1716.lowfreq: -18.2048 -11.8931 -6.5437 -0.0010 -0.0007 -0.0005 28.2983 50.4804 93.1305
frequency: 27.8164 50.4439 93.1028 156.5035 193.9361 228.3268 275.2938 291.6747 340.5933 352.0341 393.9854 411.7833 482.1329 504.3181 541.5215 635.3979 710.3467 726.7239 784.6890 804.7598 826.0265 840.2024 892.6053 922.5723 949.4370 968.2679 986.2357 1003.9969 1045.0173 1077.7569 1097.6723 1114.8805 1142.8037 1178.7023 1189.6188 1205.5111 1245.3599 1262.2568 1292.0014 1312.5408 1329.3792 1389.5111 1394.0520 1424.2486 1454.5402 1461.9216 1471.4450 1502.2900 1597.3203 1625.6854 1687.3547 2958.7472 2964.9849 3007.9953 3038.7907 3065.2470 3081.9338 3090.6772 3107.2278 3131.0837 3134.3071 3167.5250 3582.0377
redmass: 3.3491 3.1972 1.8903 2.4080 1.5029 3.5159 3.2300 2.9432 3.4717 1.1500 3.7183 2.9238 2.8891 3.8755 2.6077 6.5482 3.4963 2.4171 1.8990 1.6196 2.3066 1.8795 1.9524 1.3578 1.4459 1.3472 1.1063 2.8311 1.5348 3.6986 1.4812 1.7897 1.3858 1.1126 1.2933 2.1851 2.8652 1.3601 1.2535 1.2841 1.4109 6.0056 1.2391 2.7226 1.1081 1.0474 1.0570 2.7080 6.4270 6.4214 6.1575 1.0590 1.0365 1.1000 1.0971 1.0924 1.0965 1.0907 1.0874 1.0909 1.0944 1.0954 1.0660
irintensity: 0.8211 0.5049 0.1821 0.6540 1.6606 0.7595 0.3727 3.7024 0.9448 146.9577 16.2936 0.9266 11.4295 5.1705 23.9970 1.2302 1.9595 3.7559 20.1432 30.8308 7.1104 31.2288 1.5055 5.8728 21.1479 3.1765 60.9625 6.2048 0.4412 3.1359 48.7626 6.9052 209.8998 8.5077 0.6951 4.9273 25.7463 2.7235 0.3455 11.8497 7.6941 19.8857 11.1644 10.8677 13.6241 13.1861 17.1170 102.0410 10.8049 24.5055 0.4424 34.1675 43.0773 18.1157 27.8005 3.4245 4.9085 73.0675 19.5548 20.0066 10.9446 6.7415 35.9509
temp: 298.150 k
press: 1.00000 atm
elementType: 8 6 6 6 6 6 6 6 6 6 6 1 1 1 1 1 1 1 1 1 1 1 1
symmnumber: 1
zpe: 497808.9 jmol-1
zpe.correction: 0.189605 hartree
zpe.thermalcorrener: 0.200712 hartree
zpe.thermalcorrenthalpy: 0.201656 hartree
zpe.thermalcorrgfe: 0.151763 hartree
zpe.sumelectzpe: -462.651935 hartree
zpe.sumelectthermal: -462.640828 hartree
zpe.sumelectthermalent: -462.639884 hartree
zpe.sumelectthermalfe: -462.689777 hartree
dipole: -0.1565 1.4784 0.2235
dipole: 1.5034
quadrupole: -55.4719 -64.2637 -67.6188
quadrupole: 8.7832 3.4004 1.1611
quadrupole: 6.9796 -1.8122 -5.1673 8.7832 3.4004 1.1611
hfenergy: -462.8415404 hartree
pointgroup: C01 [X(C10H12O1)]
dipole: -0.0902722 0.5837454 -0.0307651 debye
dipolederiv: -1.4358114 0.3463665 -0.1563242 0.4240697 -0.1664799 0.0511408 -0.1792481 0.0450787 -0.4555579 0.1779852 -0.1013035 0.0662706 -0.1103278 -0.2048715 -0.000275 0.1987889 0.0243641 -0.0504176 0.0380963 -0.0532419 0.0209174 -0.1440182 0.1486767 0.0450349 -0.0898601 0.0166201 0.1109217 0.0332438 0.1155766 0.0284272 -0.0114883 0.1294663 -0.0229597 0.0393482 0.0002952 -0.1452041 -0.0003189 -0.0480304 0.0280222 0.077764 0.11396 0.0025362 0.0063417 -0.0210307 -0.1365131 -0.0688056 0.1313558 -0.0005713 0.2842467 -0.1588412 0.0203333 -0.1446081 -0.026331 0.1185542 -0.2469451 0.010306 0.0066713 0.3733851 -0.0705579 0.0508696 -0.0327803 -0.0018271 -0.2043326 -0.3077563 0.1272261 -0.0226232 -0.1686345 0.0795899 -0.0353737 -0.0102 0.0100357 -0.1752753 1.3375982 -0.3129275 0.2017945 -0.3830467 0.1206523 -0.0546524 0.2178215 -0.0535083 0.0995838 0.0342795 0.2089258 -0.0097043 0.2083127 -0.1183803 -0.020381 -0.0538113 -0.0569931 0.1550901 -0.0840146 -0.1119021 0.068312 -0.1425857 0.0490199 0.043098 0.0014099 0.0193185 0.0196797 -0.0066402 -0.0640294 0.0087316 -0.0040031 -0.1657231 -0.0086365 0.0734817 -0.0254557 0.0831004 -0.063184 0.0221952 -0.0866193 0.0056282 0.0841175 -0.0545434 -0.0557706 0.0165302 -0.1275256 0.0811247 0.0722089 -0.0141474 0.0497054 -0.1059132 0.0177779 -0.0086943 0.0187947 0.1436653 0.02415 -0.1010333 -0.0224895 -0.1187274 0.01056 -0.0076025 -0.0348314 -0.0084323 0.1317303 0.0977667 -0.0483897 -0.007161 -0.081253 0.1128725 0.0106408 0.030893 0.0052627 -0.1350004 -0.0989224 -0.1081528 -0.0354207 -0.093849 0.0104378 -0.0088659 -0.0437161 -0.0138508 0.1683088 0.0718133 0.0422394 -0.0147285 0.0554141 -0.0588987 0.0160059 -0.0124205 0.0168899 0.16651 0.0879424 -0.0551194 0.0255954 -0.0586722 0.1179232 0.0192623 0.0193089 0.0120814 -0.1683975 -0.1885614 0.0358396 -0.0220877 0.0870199 0.0685424 0.0271052 -0.0038025 0.0600323 0.0854583 0.0664417 -0.0117322 0.0142611 -0.0944408 -0.1649023 -0.0368678 0.063936 -0.0438796 0.0820218 0.0820006 -0.0185222 -0.0754343 -0.0193799 0.0891592 -0.0448605 0.0161463 0.0063471 -0.1500077 0.3685175 -0.0778556 -0.0016921 -0.135119 0.0795903 -0.0087866 0.0022674 -0.0003421 0.3836076 unknown
polarizability: 162.8353095|11.699147|107.2546797|10.8604449|-2.2824492|64.7948016 unknown
InChI: InChI=1S/C10H12O/c1-2-3-4-9-5-7-10(11)8-6-9/h2-3,5-8,11H,4H2,1H3
charge 0 multiplicity 1
23 atoms
O  3.990191 -0.736947 0.43332
C  0.009675 0.596045 -0.255711
C  -1.425063 1.046671 -0.54134
C  1.057351 1.539315 -0.123828
C  0.334981 -0.782271 -0.143668
C  -2.474973 0.332807 0.29125
C  2.391021 1.130742 0.104809
C  1.657945 -1.2091 0.083349
C  2.688199 -0.24854 0.206492
C  -3.527004 -0.360088 -0.218621
C  -4.589653 -1.059648 0.598941
H  -1.491433 2.139362 -0.362016
H  -1.660112 0.893659 -1.614673
H  0.832797 2.610346 -0.20006
H  -0.465105 -1.526794 -0.230627
H  -2.349853 0.396832 1.383268
H  3.187415 1.880315 0.20514
H  1.911177 -2.270139 0.16905
H  -3.631642 -0.424831 -1.313873
H  -5.595563 -0.648784 0.383512
H  -4.630768 -2.141044 0.362526
H  -4.401205 -0.952355 1.681797
H  4.635522 0.009347 0.505364
