program: Gaussian 09
title: 000276526
version: EM64L-G09RevD.01
frameworkgroup: C1[X(C11H17NO2)]
method: RPBEPBE
basis: SDD
operation: Freq
keyword: #p
keyword: freq=noraman
keyword: PBEPBE/SDD
title: #p freq=noraman PBEPBE/SDD
converged: YES YES NO NO
title: Mulliken charges:
elementType: O O N C C C C C C C C C C C H H H H H H H H H H H H H H H H H
charge: -0.270564 -0.254310 -0.024331 -0.029974 -0.494841 -0.714028 -0.692585 -0.173527 0.033272 0.130764 -0.683193 -0.680597 0.201625 -0.223315 0.211935 0.246154 0.221697 0.221938 0.221845 0.214469 0.214713 0.218323 0.224013 0.278924 0.233822 0.215601 0.251840 0.226378 0.208155 0.234996 0.230800
chargesum: 0.00000
title: Mulliken charges with hydrogens summed into heavy atoms:
elementType: O O N C C C C C C C C C C C
charge: -0.270564 -0.254310 -0.024331 0.181961 -0.026990 -0.055776 -0.035536 0.105397 0.267093 0.130764 0.010626 -0.006646 0.201625 -0.223315
polarizability: 1.77097450e+02 9.74347267e+00 1.34053972e+02 6.00391101e+00 2.24910339e-02 9.67845775e+01
1716.lowfreq: -13.3034 -4.5319 -0.0002 0.0006 0.0007 3.1564 16.3975 34.8881 45.1996
frequency: 14.9803 34.7698 45.1393 58.3239 79.3776 91.9102 104.7873 144.6292 196.8613 207.0218 220.0455 233.4865 236.3672 252.5234 277.1586 309.9785 335.7368 367.6244 377.2109 392.6166 403.1884 453.7099 512.6316 524.9496 590.1909 674.6525 729.5568 770.2612 773.7232 796.8227 884.2089 899.0065 920.1038 927.1687 936.2599 941.9754 960.3064 973.9383 1013.5372 1063.3439 1096.6457 1102.4882 1157.9518 1163.6222 1179.4956 1184.5449 1215.8327 1229.4668 1278.8625 1321.1459 1328.7980 1330.9867 1332.8005 1358.8468 1380.7798 1383.7927 1397.5051 1400.7013 1453.9479 1456.9256 1466.1192 1466.3444 1472.5292 1473.6656 1484.1625 1487.9524 1489.1078 1601.1725 1626.5105 2176.2741 2959.6774 2974.0019 2976.5412 2980.9394 2991.0001 2995.2771 3026.7066 3047.5037 3068.2611 3070.9992 3075.3802 3076.8442 3087.0185 3095.7316 3101.3338 3106.4374 3116.2859
redmass: 3.4579 4.2941 3.1952 2.8602 4.3411 5.5923 5.3243 3.6599 1.0271 1.7533 1.4934 1.9551 1.1045 2.0195 3.2553 3.0794 3.0772 2.1657 3.4718 2.7948 2.9209 2.9537 7.5784 3.4941 4.4191 4.6483 7.4593 3.2381 4.5584 4.1832 1.7154 2.3634 1.2775 1.2132 1.6649 1.3831 1.5448 1.5538 2.8210 2.3203 1.6704 1.6328 2.0304 2.3113 2.1453 2.0832 2.7070 1.4380 1.4556 1.3818 1.5651 1.4882 1.3715 1.5042 1.2541 1.2117 1.2302 1.2164 1.1107 1.0519 1.0471 1.0444 1.0500 1.0531 1.0463 1.0480 1.0523 10.3315 8.3291 12.6264 1.0645 1.0356 1.0402 1.0787 1.0356 1.0359 1.0865 1.0965 1.1000 1.0996 1.0993 1.0990 1.0993 1.0989 1.1011 1.1007 1.0894
irintensity: 0.0450 3.0855 0.3863 0.7860 1.4646 0.5125 1.9410 2.6308 0.0346 3.0526 1.4703 1.8785 0.3293 3.7710 0.9994 0.4066 1.7636 0.1434 5.5834 1.9644 7.7755 1.0113 1.0671 8.4788 3.3190 0.9437 12.1986 0.2157 11.8415 2.3873 20.0290 22.7369 4.9941 2.6229 2.1346 0.3861 2.5169 13.2726 110.2809 53.6973 165.9521 10.1110 12.3060 14.8028 132.6945 4.8867 204.8644 112.7316 6.6773 8.6538 2.6095 3.9428 2.1009 4.8261 35.1021 22.8352 18.5838 15.4470 13.0893 6.8323 5.4728 1.3192 6.9626 5.0586 19.3325 19.9266 15.2006 137.6517 104.6105 11.8592 11.8615 34.0795 20.0215 28.3410 14.6438 20.4302 7.4542 9.7206 19.4647 15.5568 49.1022 86.6038 7.1630 46.3085 14.1952 31.9649 0.8011
temp: 298.150 k
press: 1.00000 atm
elementType: 8 8 7 6 6 6 6 6 6 6 6 6 6 6 1 1 1 1 1 1 1 1 1 1 1 1 1 1 1 1 1
symmnumber: 1
zpe: 675764.5 jmol-1
zpe.correction: 0.257385 hartree
zpe.thermalcorrener: 0.274317 hartree
zpe.thermalcorrenthalpy: 0.275261 hartree
zpe.thermalcorrgfe: 0.210884 hartree
zpe.sumelectzpe: -633.461184 hartree
zpe.sumelectthermal: -633.444252 hartree
zpe.sumelectthermalent: -633.443308 hartree
zpe.sumelectthermalfe: -633.507685 hartree
dipole: -0.6814 -2.3439 0.2580
dipole: 2.4546
quadrupole: -62.6963 -101.9821 -83.2552
quadrupole: -0.4641 3.1191 2.6373
quadrupole: 19.9482 -19.3376 -0.6106 -0.4641 3.1191 2.6373
hfenergy: -633.7185691 hartree
pointgroup: C01 [X(C11H17N1O2)]
dipole: -0.2794247 -0.7501317 -0.5401849 debye
polarizability: 177.2434067|2.5308355|117.2973465|11.0033308|18.382908|113.3952458 unknown
InChI: InChI=1S/C11H17NO2/c1-8(2)5-6-10(7-12)11(13)14-9(3)4/h6,8-9H,5H2,1-4H3
charge 0 multiplicity 1
31 atoms
O  2.090343 -0.023684 -0.048448
O  0.956066 -1.505817 -1.459466
N  0.00324 2.431981 1.192709
C  -3.879192 -0.123878 -0.230994
C  -2.73119 0.762154 -0.830738
C  -4.220094 -1.33713 -1.128999
C  -3.552466 -0.564391 1.214648
C  -1.430155 0.034186 -1.000382
C  3.388559 -0.774835 -0.256007
C  -0.229773 0.358532 -0.41731
C  4.022983 -0.298618 -1.569904
C  4.222432 -0.474934 0.990149
C  0.971267 -0.494821 -0.713332
C  -0.088082 1.488323 0.463024
H  -4.77156 0.534721 -0.197219
H  -2.595483 1.659089 -0.199308
H  -3.064067 1.106454 -1.833196
H  -5.122685 -1.852035 -0.752452
H  -3.400218 -2.078888 -1.139637
H  -4.418094 -1.028457 -2.172778
H  -4.404033 -1.113737 1.656259
H  -2.671187 -1.232569 1.237794
H  -3.334176 0.305013 1.86187
H  -1.412523 -0.849264 -1.654915
H  3.127475 -1.84754 -0.325106
H  4.986801 -0.816123 -1.728314
H  3.367773 -0.523907 -2.427891
H  4.213645 0.788426 -1.535606
H  5.190071 -1.005071 0.928979
H  3.699506 -0.804981 1.903603
H  4.420316 0.607703 1.07467
