program: Gaussian 09
title: 000278954
version: EM64L-G09RevD.01
frameworkgroup: C1[X(C10H13NO)]
method: RPBEPBE
basis: SDD
operation: Freq
keyword: #p
keyword: freq=noraman
keyword: PBEPBE/SDD
title: #p freq=noraman PBEPBE/SDD
converged: YES YES NO NO
title: Mulliken charges:
elementType: O N C C C C C C C C C C H H H H H H H H H H H H H
charge: -0.281949 -0.321542 0.086940 -0.484315 -0.298788 0.405445 -0.722068 -0.386945 -0.386537 -0.223869 -0.224218 -0.242623 0.268100 0.233862 0.248835 0.210352 0.208720 0.219661 0.231534 0.246933 0.272264 0.267389 0.223358 0.223669 0.225792
chargesum: 0.00000
title: Mulliken charges with hydrogens summed into heavy atoms:
elementType: O N C C C C C C C C C C
charge: -0.281949 -0.053442 0.086940 -0.001619 0.120284 0.405445 -0.023940 -0.114681 -0.119148 -0.000511 -0.000549 -0.016831
polarizability: 1.36008110e+02 5.53186333e-01 1.09314693e+02 6.51465403e+00 2.17228582e+00 8.43621792e+01
1716.lowfreq: -14.2062 -10.7519 -0.0004 0.0005 0.0009 6.4795 44.5146 66.2169 107.3491
frequency: 44.4567 66.1901 107.3405 176.2289 207.8307 210.3471 284.5469 300.8295 342.6544 407.5923 464.5243 488.3495 565.1095 614.5436 636.1997 676.7451 711.3171 711.6866 752.0624 762.4544 774.5445 828.2257 865.9185 905.6152 924.4663 940.4962 951.5425 989.5045 989.9078 999.1845 1022.2293 1041.0614 1056.0896 1067.9089 1089.9605 1120.4534 1162.3582 1169.1890 1178.2436 1195.0341 1219.0970 1281.1324 1304.2446 1305.9961 1317.1803 1379.7373 1384.2792 1423.6409 1434.5579 1456.4332 1468.0835 1470.9608 1481.1789 1485.7759 1590.6780 1610.2681 2990.5467 2994.7787 3028.0379 3052.1883 3094.4684 3098.1391 3112.7416 3120.2175 3130.1235 3144.8585 3152.5688 3163.4134 3428.7801
redmass: 3.4424 2.6977 2.5567 2.8745 1.4594 1.9560 3.1635 3.2084 3.9649 2.9030 4.3674 3.3949 3.1040 6.3580 3.4279 3.3339 3.1417 2.0215 2.5992 3.0405 1.8675 1.4888 1.2443 3.2455 1.5150 1.5013 5.6851 2.5205 1.9930 1.3100 2.4147 2.8524 1.9665 1.6370 1.7114 1.7816 1.2821 1.0550 1.1251 1.5416 3.2056 2.2799 1.2309 1.2872 1.3525 8.2301 1.2647 1.3029 1.9439 1.0740 1.2904 1.1028 1.6061 1.0841 6.4283 6.1338 1.0577 1.0365 1.0622 1.1073 1.0994 1.1068 1.0996 1.0845 1.0882 1.0924 1.0955 1.1009 1.0748
irintensity: 0.1536 3.0428 1.4037 4.6705 0.4745 0.6508 0.6032 3.8281 11.4888 0.0866 11.8156 5.5699 34.4163 0.2769 11.8072 9.2270 53.4828 57.7130 68.2429 28.3273 40.5083 3.4198 0.0902 7.4708 2.8830 1.3918 65.5085 0.1481 0.2449 1.4106 13.7513 4.7161 20.7797 19.6239 6.5452 13.7127 1.7816 0.0204 4.0399 2.7736 37.5603 49.2924 2.2799 2.5508 8.2568 0.7576 26.9270 11.5560 20.7776 6.4734 3.8380 10.9097 10.4266 1.7266 0.1712 1.6807 67.7295 20.1525 43.2701 28.8768 26.6779 51.3222 11.2067 0.0788 11.1660 16.8004 23.0477 21.8510 1.5631
temp: 298.150 k
press: 1.00000 atm
elementType: 8 7 6 6 6 6 6 6 6 6 6 6 1 1 1 1 1 1 1 1 1 1 1 1 1
symmnumber: 1
zpe: 549845.9 jmol-1
zpe.correction: 0.209425 hartree
zpe.thermalcorrener: 0.220223 hartree
zpe.thermalcorrenthalpy: 0.221167 hartree
zpe.thermalcorrgfe: 0.172596 hartree
zpe.sumelectzpe: -517.923768 hartree
zpe.sumelectthermal: -517.912971 hartree
zpe.sumelectthermalent: -517.912026 hartree
zpe.sumelectthermalfe: -517.960597 hartree
dipole: 0.9393 0.9105 -0.6940
dipole: 1.4809
quadrupole: -62.8441 -72.0802 -69.8919
quadrupole: 3.7515 -0.3732 0.9427
quadrupole: 5.4280 -3.8081 -1.6199 3.7515 -0.3732 0.9427
hfenergy: -518.1331932 hartree
pointgroup: C01 [X(C10H13N1O1)]
dipole: 0.3793446 0.3692538 -0.2433207 debye
dipolederiv: -0.7456273 0.1338143 0.1886947 0.0359396 -0.5704883 -0.0091835 0.2268235 -0.1549057 -0.6790656 -0.365476 0.0014311 0.186146 -0.0464723 -0.7125937 -0.1118873 0.1297581 0.0159317 -0.4620121 0.9832572 0.0216612 -0.1765548 -0.0542969 0.6607773 0.1111873 -0.1499695 0.0294591 0.5347195 0.2102124 -0.0506229 0.0512287 -0.0270574 0.1512879 0.0460784 -0.0316291 -0.0096762 0.2849976 0.4493424 -0.0011868 -0.0866366 0.1236031 0.0766312 -0.0969255 -0.2080524 0.1413453 0.4566637 0.0192064 0.0160242 0.0875231 0.0080297 -0.1100265 -0.0162399 0.1143105 -0.0028262 -0.0969572 -0.0887042 -0.0047536 -0.0494595 -0.0184943 0.0214175 0.038817 0.0481547 0.0293033 -0.1390465 -0.1338198 0.0780134 0.0219753 0.0162218 0.0200802 0.0235212 -0.0002432 0.0213709 -0.1337855 -0.1105712 -0.0912387 0.0081032 -0.0370689 0.0121821 -0.0045666 -0.0038719 0.0005826 -0.1399223 -0.012522 -0.0929781 0.039123 -0.0917858 0.0798601 -0.0143804 0.0311035 -0.0135887 -0.1372036 -0.0270499 0.0779701 0.0433093 0.0762072 0.0900308 0.0399961 0.0443697 0.0393105 -0.1354817 0.0604929 0.0016705 0.0753862 0.0022331 -0.0567306 0.0052944 0.0632111 0.0075157 -0.1478331 -0.0372314 -0.0715118 -0.0948587 0.0535149 0.277395 0.0818605 -0.0436313 0.0158708 0.0850423 -0.0902512 -0.11477 0.0928787 -0.1010364 0.0140502 0.0480387 0.0404948 0.0261963 0.0500182 -0.0116835 0.0653222 -0.1365941 0.0502449 0.0273046 0.0098151 -0.0874402 0.0143457 -0.0343359 0.0239885 -0.0673102 -0.1065605 -0.0332096 0.0168521 -0.0733882 -0.0135953 -0.0852981 -0.1561373 -0.2092547 0.090778 0.0783308 0.0444065 0.0479662 -0.0043929 0.0381102 -0.0051969 0.0237282 -0.166878 -0.0132406 -0.1051904 -0.0209169 0.1029955 -0.0041243 -0.0956267 0.0052942 0.0299321 0.0499084 0.083768 0.0544538 0.0836719 -0.021563 -0.0959069 0.0610821 -0.0304037 0.0400732 0.0731059 -0.0831546 0.0280924 -0.0818319 -0.0416718 0.0737973 0.0371026 0.0066604 0.0784097 0.1204193 -0.0742856 -0.0288776 -0.0637586 -0.0139737 -0.0234051 -0.0223206 -0.0252966 0.1261766 0.0989463 0.0869462 -0.023688 0.073566 -0.0021225 0.006309 -0.0164046 0.0063448 0.1318502 0.0099354 0.093199 -0.0303529 0.1115957 -0.075219 0.0163999 -0.0339827 0.0146417 0.1453526 0.0269104 -0.0802505 -0.0362374 -0.0980589 -0.0841349 -0.0413782 -0.0407068 -0.0415714 0.1398275 -0.1266562 -0.0052949 -0.0802346 -0.0052464 0.0896934 -0.0053361 -0.0870462 -0.0054095 0.1349896 unknown
polarizability: 134.8631791|0.84759|109.2871739|9.9000248|2.6853671|85.5346285 unknown
InChI: InChI=1S/C10H13NO/c1-10(11-7-8-12-10)9-5-3-2-4-6-9/h2-6,11H,7-8H2,1H3
charge 0 multiplicity 1
25 atoms
O  1.902203 -1.141751 0.173985
N  1.847384 1.222092 0.274207
C  1.138832 0.032735 0.76875
C  2.212209 0.886222 -1.131649
C  2.418343 -0.674269 -1.134242
C  -0.316063 0.000226 0.268357
C  1.224148 -0.120236 2.291305
C  -1.053167 1.201462 0.127501
C  -0.949932 -1.238933 0.005764
C  -2.407949 1.164231 -0.273328
C  -2.304985 -1.276291 -0.392626
C  -3.039251 -0.074849 -0.531991
H  2.682425 1.404049 0.849915
H  3.110119 1.445318 -1.440951
H  1.379129 1.162164 -1.79988
H  1.857352 -1.153538 -1.958823
H  3.481151 -0.970051 -1.189612
H  2.279616 -0.118855 2.618798
H  0.679295 0.697918 2.792346
H  0.769635 -1.077037 2.594804
H  -0.545247 2.152721 0.32024
H  -0.364433 -2.160066 0.098195
H  -2.969887 2.098913 -0.38439
H  -2.786827 -2.239267 -0.597846
H  -4.090197 -0.104009 -0.842029
