program: Gaussian 09
title: 000278894
version: EM64L-G09RevD.01
frameworkgroup: C1[X(C11H12N2O3)]
method: RPBEPBE
basis: SDD
operation: Freq
keyword: #p
keyword: freq=noraman
keyword: PBEPBE/SDD
title: #p freq=noraman PBEPBE/SDD
converged: YES YES NO NO
title: Mulliken charges:
elementType: O O O N N C C C C C C C C C C C H H H H H H H H H H H H
charge: -0.300825 -0.268558 -0.237832 -0.399901 0.007424 0.243416 -0.096178 0.211137 0.244166 0.053679 -0.310302 -0.379384 0.038141 -0.759939 -0.526130 -0.494816 0.362445 0.245810 0.255201 0.246149 0.246179 0.231756 0.246752 0.225521 0.225466 0.235830 0.219470 0.235326
chargesum: 0.00000
title: Mulliken charges with hydrogens summed into heavy atoms:
elementType: O O O N N C C C C C C C C C C C
charge: -0.300825 -0.268558 -0.237832 -0.037457 0.007424 0.243416 -0.096178 0.211137 0.244166 0.053679 -0.064492 -0.124184 0.038141 -0.035855 0.171609 0.195810
polarizability: 2.04542996e+02 1.63717003e+01 1.94175545e+02 -1.26335737e-02 -3.05412203e-02 7.02947235e+01
1716.lowfreq: -1.4272 -0.0005 0.0002 0.0003 8.1945 10.9752 22.1674 61.6994 79.9044
frequency: 22.1069 61.6992 79.8940 91.4361 120.6743 142.8993 150.5058 189.2065 210.5461 230.7297 243.1528 280.4524 292.2357 333.5831 352.7291 367.6656 382.6740 418.7139 425.4678 505.9425 547.7216 554.1767 601.9000 611.5021 635.5727 668.7436 704.0257 719.3555 769.7141 780.7141 800.7899 805.9760 918.7405 919.9553 950.1414 996.1786 1031.5479 1055.4716 1077.6997 1110.6487 1117.2146 1150.2607 1155.1631 1161.1738 1188.9203 1236.3175 1249.3190 1286.3246 1303.9318 1374.2692 1391.0606 1399.7681 1431.9171 1437.3047 1441.7667 1443.6134 1445.7966 1451.8989 1453.6309 1465.6867 1474.6788 1492.1913 1540.6461 1583.1981 1615.2047 1624.7278 2964.9821 2989.5649 3000.1237 3054.5801 3064.4826 3109.4289 3122.5287 3124.6507 3129.2426 3158.5091 3180.8273 3499.2099
redmass: 2.9847 3.3966 5.2866 1.0484 3.8501 4.4194 4.2483 3.5979 1.4218 1.3261 1.9706 3.1296 4.0385 5.0420 4.6600 5.0857 7.4743 4.8727 6.9744 5.6083 5.5541 4.8705 5.2677 4.0886 6.4709 6.4555 5.5482 4.2488 3.8808 4.5637 1.5296 1.5341 1.3451 4.9144 8.5797 2.0624 1.5557 6.5704 2.3665 1.2476 1.2564 1.3921 1.8076 2.7845 1.6795 1.7871 5.4184 4.5825 3.8943 2.6115 1.3142 5.4268 3.1714 1.2874 1.0462 1.2998 1.1718 1.0519 1.0707 1.0496 1.0696 2.7889 6.3784 7.6762 8.6424 5.5500 1.0326 1.0374 1.0281 1.1044 1.0954 1.1044 1.1059 1.1003 1.1000 1.0879 1.0956 1.0765
irintensity: 5.1935 6.8587 0.1535 0.6999 2.4127 3.1843 0.8166 3.4165 3.0221 4.9370 2.4739 6.1322 4.4252 0.4888 1.5530 0.0100 9.1934 0.0900 5.6169 10.9057 0.1865 0.3446 5.3920 1.3815 21.2145 9.0268 17.3555 1.9391 10.7533 3.8987 0.4057 156.7805 0.2798 0.0209 23.3695 29.8736 4.4685 175.3428 19.3786 0.0985 0.0922 0.5299 13.0803 94.8997 2.2530 141.4128 119.5814 11.6740 5.7234 82.2064 54.8753 10.4548 18.2454 46.9163 14.6254 8.9843 4.3768 11.6604 40.7712 14.9300 40.4187 204.2742 35.7233 46.0871 198.2184 299.0969 73.9523 8.3498 59.6858 44.6929 10.7592 30.3685 40.9666 9.0882 17.9704 8.4606 5.2102 67.4193
temp: 298.150 k
press: 1.00000 atm
elementType: 8 8 8 7 7 6 6 6 6 6 6 6 6 6 6 6 1 1 1 1 1 1 1 1 1 1 1 1
symmnumber: 1
zpe: 565098.0 jmol-1
zpe.correction: 0.215234 hartree
zpe.thermalcorrener: 0.230548 hartree
zpe.thermalcorrenthalpy: 0.231492 hartree
zpe.thermalcorrgfe: 0.172134 hartree
zpe.sumelectzpe: -760.367244 hartree
zpe.sumelectthermal: -760.351930 hartree
zpe.sumelectthermalent: -760.350986 hartree
zpe.sumelectthermalfe: -760.410344 hartree
dipole: 3.2401 2.3260 0.0312
dipole: 3.9887
quadrupole: -68.9080 -106.8859 -94.8023
quadrupole: -9.4221 -0.0001 0.0554
quadrupole: 21.2907 -16.6872 -4.6035 -9.4221 -0.0001 0.0554
hfenergy: -760.5824782 hartree
pointgroup: C01 [X(C11H12N2O3)]
dipole: 1.5634532 -0.0454409 -0.1270093 debye
polarizability: 215.4227335|0.1881569|181.3643478|-12.581589|9.6470008|72.2261838 unknown
InChI: InChI=1S/C11H12N2O3/c1-6-11(14)13-10-8(16-3)5-4-7(15-2)9(10)12-6/h4-5,13H,1-3H3
charge 0 multiplicity 1
28 atoms
O  1.441511 -2.697769 -0.379502
O  1.265499 2.932563 0.121163
O  -3.266159 -1.78943 0.107363
N  -0.951513 -1.501403 -0.069028
N  -1.263061 1.261978 0.198211
C  0.190496 -0.698449 -0.09853
C  0.022135 0.719724 0.039261
C  1.467581 -1.293281 -0.26061
C  1.201449 1.546191 0.008306
C  -2.330732 0.471466 0.222581
C  2.60447 -0.466305 -0.28769
C  2.463913 0.933836 -0.154312
C  -2.259635 -1.016626 0.086797
C  -3.702801 1.063108 0.395081
C  2.727124 -3.378181 -0.543756
C  0.078633 3.783891 0.3127
H  -0.822891 -2.515106 -0.167562
H  3.605471 -0.889539 -0.410924
H  3.341942 1.584752 -0.174358
H  -4.197795 0.641853 1.289641
H  -4.351397 0.796439 -0.459876
H  -3.634281 2.157744 0.485698
H  2.483874 -4.448271 -0.613524
H  3.38505 -3.199315 0.328359
H  3.235534 -3.048305 -1.470133
H  -0.620593 3.690442 -0.533844
H  0.494828 4.802289 0.370921
H  -0.455552 3.521504 1.240165
