program: Gaussian 09
title: 000278937
version: EM64L-G09RevD.01
frameworkgroup: C1[X(C22H17FN2)]
method: RPBEPBE
basis: SDD
operation: Freq
keyword: #p
keyword: freq=noraman
keyword: PBEPBE/SDD
title: #p freq=noraman PBEPBE/SDD
converged: YES YES NO NO
title: Mulliken charges:
elementType: F N N C C C C C C C C C C C C C C C C C C C C C C H H H H H H H H H H H H H H H H H
charge: -0.207535 -0.478549 -0.028632 0.267196 0.025272 0.189932 0.203574 0.193040 -0.578331 -0.621367 0.169699 0.209820 -0.113134 -0.500304 -0.838419 -0.394212 0.355045 -0.378071 -0.255545 -0.215539 -0.361803 -0.360005 -0.385655 -0.378056 0.315452 0.231740 0.222535 0.277771 0.307016 0.231167 0.215865 0.212382 0.246749 0.247582 0.237972 0.233171 0.224885 0.224215 0.269060 0.274816 0.255246 0.253959
chargesum: 0.00000
title: Mulliken charges with hydrogens summed into heavy atoms:
elementType: F N N C C C C C C C C C C C C C C C C C C C C C C
charge: -0.207535 -0.171534 -0.028632 0.267196 0.025272 0.189932 0.203574 0.193040 -0.124056 -0.343596 0.169699 0.209820 -0.113134 -0.053272 -0.131706 -0.156240 0.355045 -0.144900 -0.030660 0.008677 -0.092743 -0.085189 -0.130409 -0.124097 0.315452
polarizability: 3.58973162e+02 -2.67248309e+01 3.21442045e+02 1.89331132e+01 -2.10472642e+00 1.35769808e+02
1716.lowfreq: -51.4548 -3.1976 -0.0002 0.0007 0.0007 5.7807 8.6350 35.0353 45.9920
frequency: -51.3427 35.0157 45.9897 51.5881 77.5817 101.8312 119.9835 140.1747 141.1011 200.4879 221.1383 238.0428 259.4938 271.8215 304.7215 325.1470 331.8689 348.5114 361.0180 389.8696 416.4123 429.7314 441.7337 480.5664 484.7795 507.9797 515.0920 532.1737 544.3684 573.0252 574.2092 584.1448 598.4119 616.4738 630.0443 666.8117 706.4809 722.9668 738.9710 753.3194 764.4820 772.1942 786.5652 793.8644 820.2056 842.1908 844.9149 852.8621 857.5166 894.1263 920.4208 922.7083 937.7851 940.1200 958.2972 970.3670 974.7701 1004.1698 1008.5289 1015.8056 1031.4825 1040.0533 1058.7561 1082.1298 1102.3257 1109.0579 1147.2838 1155.1219 1163.5657 1171.9667 1196.8205 1207.4464 1227.9299 1232.0843 1248.5862 1267.5737 1287.6290 1292.6309 1300.4662 1330.9472 1341.3014 1354.5237 1370.8186 1386.2648 1397.9491 1404.2511 1416.5175 1437.7600 1445.7328 1448.2395 1455.0564 1471.1662 1480.3137 1488.6061 1489.0525 1493.4952 1546.5447 1587.4509 1589.6321 1597.0361 1608.8530 1618.6112 1636.8741 2945.9999 2962.8060 2970.2667 3046.7957 3049.6626 3055.6659 3086.2616 3127.5077 3135.3025 3148.1118 3149.6133 3155.2361 3160.4266 3165.9604 3174.7353 3180.0741 3614.5051
redmass: 1.0796 5.7086 5.4529 4.3770 4.7726 3.9549 5.6254 3.6859 4.0324 5.1283 4.7813 3.9573 3.6877 3.3801 4.7996 3.7782 4.7508 6.7371 3.6735 5.2588 3.0569 4.9570 3.0709 3.7465 1.3740 2.8066 4.4919 4.6220 3.9512 3.9348 4.2622 3.9745 5.6976 6.6141 6.9270 3.9322 4.5824 3.8791 3.3242 1.5396 4.7310 4.9402 3.5997 6.1859 1.2540 1.9122 3.4202 3.1278 1.4715 3.3169 2.4097 2.0788 1.4038 2.4079 1.3700 1.3476 1.3128 3.0757 2.2320 2.0515 1.7277 2.6834 2.3276 2.2625 1.4512 1.7647 2.0366 1.4732 1.2312 1.2504 2.0771 1.8221 1.9223 1.2811 2.4496 2.6310 2.0744 1.4769 1.4979 2.4324 2.1542 1.9699 6.6004 4.2029 1.2571 3.9547 3.1202 2.9217 1.5703 1.5939 1.1518 1.5469 2.6660 2.4168 1.3431 2.7994 7.1467 7.8909 6.8953 7.9703 6.5808 6.6381 7.9470 1.0693 1.0652 1.0399 1.0965 1.0943 1.0933 1.0960 1.0853 1.0893 1.0951 1.0895 1.0910 1.0884 1.1002 1.0963 1.0975 1.0797
irintensity: 0.4799 0.1783 0.3607 0.0663 0.4602 0.6066 0.7220 0.3916 1.5847 1.7771 0.6248 1.1299 0.2805 5.1676 2.4131 2.4192 1.2278 1.8208 2.0050 2.7179 0.0380 2.8452 6.9426 1.4479 63.6036 42.7956 0.9908 1.5130 14.2515 3.6391 20.8446 13.2636 1.1144 1.4964 1.6990 6.4566 7.5380 3.8483 32.9680 65.3667 5.6206 15.4497 20.2777 13.2717 3.0927 63.3947 8.4113 7.1411 0.3257 10.4156 4.0572 8.2696 1.5967 4.2957 0.7543 2.9703 0.0101 5.3878 12.4618 9.1972 2.0003 5.1535 4.6976 8.0432 16.0654 8.7586 17.8973 73.4197 1.0384 1.7941 29.2819 7.3764 1.4080 10.1933 37.2499 105.4793 28.9213 24.3324 16.5632 49.4285 107.1643 36.4476 11.7611 24.9488 13.8429 10.9343 2.8044 11.5003 3.1307 24.6135 4.0893 19.3098 62.8233 11.1002 17.0526 70.3196 69.8477 6.4417 2.5234 17.6820 51.0808 84.1907 6.2516 49.2961 32.8412 38.3991 24.2574 55.4497 36.4716 15.3264 1.3104 3.2029 23.7595 15.8134 0.7506 1.7032 34.4564 4.6964 4.6176 52.4018
temp: 298.150 k
press: 1.00000 atm
elementType: 9 7 7 6 6 6 6 6 6 6 6 6 6 6 6 6 6 6 6 6 6 6 6 6 6 1 1 1 1 1 1 1 1 1 1 1 1 1 1 1 1 1
symmnumber: 1
zpe: 862590.2 jmol-1
zpe.correction: 0.328543 hartree
zpe.thermalcorrener: 0.347500 hartree
zpe.thermalcorrenthalpy: 0.348444 hartree
zpe.thermalcorrgfe: 0.281275 hartree
zpe.sumelectzpe: -1056.214338 hartree
zpe.sumelectthermal: -1056.195381 hartree
zpe.sumelectthermalent: -1056.194437 hartree
zpe.sumelectthermalfe: -1056.261606 hartree
dipole: 5.6956 2.6918 0.4554
dipole: 6.3161
quadrupole: -141.5184 -133.6228 -145.7059
quadrupole: 3.0029 6.7197 1.9549
quadrupole: -1.2361 6.6596 -5.4235 3.0029 6.7197 1.9549
hfenergy: -1056.5428812 hartree
pointgroup: C01 [X(C22H17F1N2)]
dipole: -2.177014 1.1779967 -0.2189717 debye
polarizability: 358.6587374|22.6800272|317.9363717|32.5682443|14.4786398|139.5899057 unknown
InChI: InChI=1S/C22H17FN2/c1-13-16-10-11-24-22(14-6-8-15(23)9-7-14)18(16)12-19-17-4-2-3-5-20(17)25-21(13)19/h2-9,12,25H,10-11H2,1H3
charge 0 multiplicity 1
42 atoms
F  5.454689 -3.27484 -0.441465
N  -3.649214 0.830376 -0.45647
N  2.561979 2.250783 0.875697
C  -0.219178 2.330091 -0.064206
C  -2.283892 1.100615 -0.271945
C  -1.61211 2.348863 -0.31562
C  -1.613774 -0.139163 0.005037
C  0.484002 1.092933 0.175253
C  0.620748 3.598801 -0.007497
C  -0.222084 -0.134119 0.222067
C  -2.627492 -1.189135 -0.017515
C  -3.882134 -0.550041 -0.308086
C  1.956411 1.162208 0.43258
C  1.7080 3.448812 1.08048
C  -2.383056 3.626222 -0.607117
C  -2.59319 -2.589783 0.176191
C  2.832176 -0.034957 0.206213
C  -5.087996 -1.273943 -0.40575
C  -3.79516 -3.323327 0.079731
C  -5.027117 -2.671116 -0.207747
C  2.609278 -0.94279 -0.864567
C  3.962726 -0.230897 1.044584
C  3.485132 -2.026869 -1.092438
C  4.842892 -1.31195 0.840556
C  4.579803 -2.188829 -0.227318
H  1.120546 3.76934 -0.98481
H  0.003113 4.488715 0.203728
H  0.308078 -1.063542 0.449112
H  -4.36602 1.526115 -0.646914
H  2.36905 4.332945 1.094863
H  1.22807 3.37724 2.081674
H  -3.262256 3.431824 -1.249151
H  -2.749787 4.106314 0.321608
H  -1.762595 4.366686 -1.137816
H  -1.649819 -3.100504 0.398829
H  -6.040262 -0.779702 -0.627288
H  -3.783687 -4.408407 0.22775
H  -5.946096 -3.26377 -0.277153
H  1.76312 -0.788228 -1.541183
H  4.141233 0.490324 1.847138
H  3.332186 -2.724737 -1.92071
H  5.711478 -1.477859 1.484377
