program: Gaussian 09
title: 000278900
version: EM64L-G09RevD.01
frameworkgroup: C1[X(C9H9NO3S2)]
method: RPBEPBE
basis: SDD
operation: Freq
keyword: #p
keyword: freq=noraman
keyword: PBEPBE/SDD
title: #p freq=noraman PBEPBE/SDD
converged: YES YES NO NO
title: Mulliken charges:
elementType: S S O O O N C C C C C C C C C H H H H H H H H H
charge: 0.968261 0.311522 -0.560133 -0.488797 -0.499716 -0.039451 0.449849 -0.067165 -0.214701 0.044002 -0.351752 -0.616518 0.156634 -0.798046 -0.765305 0.257950 0.330320 0.254411 0.269702 0.258909 0.218794 0.248372 0.248307 0.384552
chargesum: 0.00000
title: Mulliken charges with hydrogens summed into heavy atoms:
elementType: S S O O O N C C C C C C C C C
charge: 0.968261 0.311522 -0.175581 -0.488797 -0.499716 -0.039451 0.449849 -0.067165 -0.214701 0.044002 -0.093801 -0.286198 0.156634 -0.015025 -0.049833
polarizability: 2.13122582e+02 5.66394739e+00 1.75345708e+02 -1.95153500e-01 7.24207085e-01 8.57106307e+01
1716.lowfreq: -10.0092 -0.0032 -0.0032 -0.0021 3.5670 8.2242 45.7128 74.2311 79.4038
frequency: 45.7063 74.2111 79.3964 124.9344 130.3112 155.7127 166.0341 186.3951 209.7463 220.5595 225.1965 265.1674 277.1106 285.6811 300.6721 333.2229 343.0809 391.8557 423.1492 491.3495 508.0802 538.6482 544.6735 553.2347 565.4538 628.0324 662.7974 773.1034 790.8207 815.8973 818.0993 830.6521 857.4538 888.6008 951.2520 962.4073 982.9344 1039.7887 1043.1843 1051.5789 1056.1098 1122.3506 1154.9058 1269.6403 1275.2036 1307.6241 1360.2252 1397.3662 1405.8591 1410.0221 1453.2038 1460.2092 1464.2504 1469.5645 1491.7600 1531.7512 1566.9445 2992.3430 2992.5237 3073.3877 3078.5090 3103.3421 3126.7578 3164.3558 3235.3987 3475.7605
redmass: 5.0069 3.4243 1.2611 6.7080 4.0983 2.2776 1.7433 1.8305 3.9781 3.3276 4.4186 7.5821 3.1157 2.9182 4.2739 9.2802 8.2492 7.7712 10.3828 6.3704 6.4450 5.6906 3.9575 5.1426 5.5196 4.9285 6.5170 5.2786 6.5483 2.5391 1.8489 10.2071 1.3228 6.0880 3.6861 12.6355 1.7883 1.7570 1.5690 1.2339 1.4966 1.8479 1.4976 4.8463 2.4373 6.3526 4.1946 1.2595 1.3319 3.9769 1.0459 1.4476 1.0513 1.1281 3.1304 6.9206 7.0667 1.0367 1.0373 1.0965 1.0973 1.1005 1.0992 1.0937 1.0960 1.0661
irintensity: 0.1650 0.1139 0.6999 1.3359 3.5311 3.4788 10.0177 24.9862 10.8062 4.6268 14.5312 11.2933 17.7082 31.3423 0.5000 20.5704 8.7251 19.8532 55.9451 20.1625 33.9247 47.7046 0.5030 63.7099 11.5929 4.6920 8.8403 0.6229 15.7803 37.9965 20.4305 64.9366 12.1612 24.0813 2.7730 92.8575 1.9456 2.4947 22.7796 60.7857 7.1261 11.1937 1.9961 4.1099 4.2301 2.9050 30.7094 11.3484 41.4160 34.4564 15.7980 73.6015 23.8955 46.7819 6.0206 21.4983 130.5146 11.5215 9.7572 2.9003 10.5777 18.5705 8.1395 3.5182 31.1503 49.2624
temp: 298.150 k
press: 1.00000 atm
elementType: 16 16 8 8 8 7 6 6 6 6 6 6 6 6 6 1 1 1 1 1 1 1 1 1
symmnumber: 1
zpe: 430509.4 jmol-1
zpe.correction: 0.163972 hartree
zpe.thermalcorrener: 0.179510 hartree
zpe.thermalcorrenthalpy: 0.180454 hartree
zpe.thermalcorrgfe: 0.121423 hartree
zpe.sumelectzpe: -1423.622144 hartree
zpe.sumelectthermal: -1423.606606 hartree
zpe.sumelectthermalent: -1423.605662 hartree
zpe.sumelectthermalfe: -1423.664693 hartree
dipole: -3.0544 1.6814 1.3715
dipole: 3.7467
quadrupole: -99.8027 -98.8297 -107.3571
quadrupole: -7.4454 6.9609 -4.1361
quadrupole: 2.1938 3.1668 -5.3606 -7.4454 6.9609 -4.1361
hfenergy: -1423.786116 hartree
pointgroup: C01 [X(C9H9N1O3S2)]
dipole: -1.1829503 0.69518 0.5386801 debye
dipolederiv: 1.9112859 -0.2991194 0.0167584 -0.3562622 1.4083356 -0.1121074 0.130648 -0.1394972 1.5234169 -0.3281632 0.1689197 0.0058993 -0.0724539 -0.1920415 -0.0073603 0.0002841 -0.0060133 0.1472264 -0.5035203 0.0074484 -0.152316 0.0200331 -0.6392647 0.2146827 -0.2331872 0.2651983 -0.874405 -0.6488788 0.0619865 -0.0039844 0.0931776 -0.5757424 -0.1071999 0.0137333 -0.0795067 -0.5513686 -0.7701092 -0.0329892 0.0297468 -0.0380562 -0.5234684 0.0350368 -0.0369942 -0.0135412 -0.4515291 -0.7268136 0.1103984 -0.0084215 0.0654231 -0.334863 0.0013024 -0.0073805 0.0034738 -0.2396398 -0.1781919 -0.0334962 -0.0021374 0.4362246 -0.547733 -0.0073016 0.0142967 -0.0037425 0.0646948 0.0072899 0.1601294 -0.0117653 0.1507609 -0.3079342 -0.0237661 0.0792326 -0.088736 -0.1382928 0.3855462 0.3262009 0.0059869 0.2551729 0.3440491 0.0089456 0.0033789 0.0128893 -0.0869065 0.4491245 -0.1479964 0.0104995 -0.1770687 0.6243871 -0.0055087 0.0124098 -0.0059222 0.0617784 -0.4698081 -0.1447208 -0.0052308 -0.4200687 -0.2711952 0.0009711 -0.0131001 -0.0056564 -0.1114312 -0.0885085 -0.3917026 -0.0049071 -0.5459712 0.2333683 0.0096408 -0.0247161 0.0334896 -0.2236281 0.8264986 0.0613799 0.0068847 0.3565145 0.3345559 0.0045221 0.0150415 0.004741 0.0242284 -0.2059657 0.2074858 -0.007912 0.1070773 -0.1880869 -0.001433 0.011399 -0.0130582 -0.0417652 -0.2530085 -0.0854203 -0.0029459 -0.2758767 0.0070678 -0.0005289 -0.007315 0.0006793 0.0175827 0.0301176 0.0475814 0.0012855 0.0949759 0.0146235 -0.0022882 0.0012105 -0.0043346 0.1652551 0.1203424 0.0017287 0.0059926 0.0399669 0.1570308 -0.004158 0.0100884 -0.0048124 0.2056317 0.0276906 -0.1516208 0.0024231 -0.0560465 -0.0219402 0.0057038 -0.00019 0.0130427 0.1299737 0.1139813 0.0543379 0.0832806 0.0432321 0.0893031 0.0395195 0.0630468 0.0045345 0.0163583 0.090616 0.0424603 -0.0797571 0.0401696 0.0723099 -0.0366799 -0.0777235 0.0041219 0.00325 -0.0043595 0.0415336 0.0005884 0.1672868 -0.0775496 -0.0037088 0.004118 -0.0033699 0.1134552 0.0255572 -0.0258317 -0.0139419 -0.0181167 0.0677703 -0.0960032 -0.0718077 -0.0916636 -0.0236008 0.0253718 -0.0266982 0.0132594 -0.0224571 0.0588497 0.0992825 0.0732717 0.0955608 -0.0149166 0.1639055 0.0480048 0.1107144 0.1123628 0.2681679 -0.0115634 0.0402551 0.022123 0.284632 unknown
polarizability: 213.4252504|4.5314703|175.0375614|0.1730336|1.0210671|85.7161091 unknown
InChI: InChI=1S/C9H9NO3S2/c1-5-3-7-9(6(2)10-5)8(4-14-7)15(11,12)13/h3-4,11H,1-2H3
charge 0 multiplicity 1
24 atoms
S  2.746487 -0.207965 -0.111149
S  -0.309963 2.916571 0.062433
O  2.63256 -1.024626 1.558118
O  2.757791 -1.347399 -1.257067
O  3.955535 0.867665 -0.076054
N  -2.146988 -1.294333 0.003056
C  -0.228471 0.203147 0.002974
C  1.131956 0.718773 0.002369
C  -1.148002 1.303251 0.028523
C  -0.79749 -1.120751 0.003462
C  -2.540037 1.113086 0.032302
C  1.271816 2.086394 0.034293
C  -3.006933 -0.219847 0.010605
C  0.033479 -2.380174 0.020434
C  -4.481186 -0.552439 0.000167
H  -3.240283 1.952085 0.050701
H  2.199849 2.655565 0.041466
H  -0.645657 -3.244546 0.054559
H  0.68002 -2.454726 -0.872126
H  0.704303 -2.401568 0.898571
H  -5.107855 0.354574 0.017694
H  -4.731434 -1.141558 -0.900293
H  -4.735613 -1.180698 0.872379
H  3.466316 -1.566183 1.681286
