program: Gaussian 09
title: 000278887
version: EM64L-G09RevD.01
frameworkgroup: C1[X(C14H20N2O)]
method: RPBEPBE
basis: SDD
operation: Freq
keyword: #p
keyword: freq=noraman
keyword: PBEPBE/SDD
title: #p freq=noraman PBEPBE/SDD
converged: YES YES NO NO
title: Mulliken charges:
elementType: O N N C C C C C C C C C C C C C C H H H H H H H H H H H H H H H H H H H H
charge: -0.278415 -0.166665 -0.595126 -0.192471 -0.439391 -0.578523 0.280337 0.278034 -0.432600 -0.360244 0.175528 -0.380182 -0.411270 -0.337221 -0.249179 -0.277475 -0.694526 0.240186 0.221368 0.245394 0.232273 0.241404 0.218813 0.219944 0.204247 0.219146 0.231412 0.231596 0.194072 0.195544 0.219994 0.226712 0.217996 0.212799 0.212189 0.325416 0.348883
chargesum: 0.00000
title: Mulliken charges with hydrogens summed into heavy atoms:
elementType: O N N C C C C C C C C C C C C C C
charge: -0.278415 -0.166665 0.079172 0.047714 0.027370 -0.104845 0.280337 0.278034 0.006157 0.063149 0.175528 -0.148770 -0.179673 0.052395 -0.029184 -0.050763 -0.051541
polarizability: 1.78152363e+02 -1.54368992e+01 1.92649715e+02 -1.05910895e+01 -1.22412820e+01 1.23779826e+02
1716.lowfreq: -4.1311 -0.0004 0.0002 0.0007 13.1701 14.9345 28.4219 43.6106 49.5514
frequency: 28.3065 43.5947 49.4691 66.8927 71.9655 93.4926 121.5440 149.0021 205.4259 225.4776 229.4867 263.7155 294.1336 309.8579 350.0845 356.5690 409.3037 428.7322 440.1899 488.4606 509.4207 539.0352 550.2248 571.4706 596.5007 601.6389 685.7676 697.7287 713.5748 734.6273 737.8594 749.9817 789.4707 793.9140 836.5567 845.0489 899.2065 903.6636 920.5831 936.7626 942.8826 965.8531 982.0676 1005.9150 1037.5846 1049.3435 1068.1523 1073.9287 1081.0648 1109.6868 1111.2825 1146.3759 1171.7996 1183.1272 1190.0359 1213.0331 1226.4878 1237.8517 1244.0542 1268.5886 1274.3280 1286.0586 1292.1307 1323.2499 1341.1170 1343.7873 1345.3750 1360.0801 1370.6530 1381.2538 1392.7027 1394.2850 1449.7061 1459.2390 1469.9544 1473.4172 1477.2624 1479.1174 1486.0259 1494.2785 1511.4336 1574.8758 1586.5949 1617.2116 1635.7056 2928.2301 2963.1782 2969.6292 2973.6202 2975.5522 2984.3383 3004.2237 3023.4509 3032.3063 3038.7332 3048.6244 3052.3843 3072.3528 3073.8483 3108.8040 3127.7245 3155.3871 3167.8126 3474.4493 3638.4108
redmass: 4.3976 5.6119 4.0440 4.2363 1.6039 4.0809 2.5347 3.3261 3.6043 1.5913 1.8192 3.4901 3.7045 2.5930 3.0375 3.1693 2.8459 3.2512 2.9695 3.9091 2.8941 3.5133 4.7972 3.7081 1.1994 1.5422 3.1729 3.6318 2.8161 3.0514 1.0826 1.5179 1.2289 4.5179 1.3919 3.5707 1.7884 1.8366 1.4612 1.4146 1.9247 1.3097 2.8825 3.4068 2.4574 2.1390 2.5533 1.9413 1.8702 2.0879 2.2929 1.5275 1.2009 1.2144 1.6114 1.6124 1.4882 2.3101 1.3529 1.2992 1.8129 1.1889 1.1294 1.5111 1.5036 1.5137 1.4764 1.4501 2.8977 5.5414 1.3432 1.5257 1.9762 1.3310 1.0722 1.0776 1.0441 1.1304 1.1195 1.2169 1.9385 5.3743 1.6996 6.3631 2.8859 1.0697 1.0590 1.0647 1.0559 1.0401 1.0596 1.0990 1.1020 1.0964 1.0852 1.1023 1.0947 1.1007 1.0994 1.0883 1.0874 1.0928 1.0983 1.0472 1.1026
irintensity: 0.5882 7.0829 3.1184 2.2804 0.0170 0.6600 0.2852 0.2175 5.5146 5.5330 6.2667 1.1472 1.5567 0.4457 0.9431 9.0387 10.5962 0.0365 4.9515 1.0173 7.2984 4.3410 0.8441 2.4414 206.3199 14.2986 12.0537 2.0613 6.9019 11.5710 9.7223 89.0745 0.4420 8.4622 0.9023 6.5866 4.1026 5.4122 2.5930 3.5710 7.8633 0.0501 0.8176 1.5291 3.1696 27.2995 0.6718 8.2686 3.6167 13.9004 14.5013 8.6232 4.0591 2.3647 32.7405 11.9858 16.6798 14.4741 38.9786 0.8967 12.9885 11.0185 9.9303 14.8684 38.2604 10.4835 7.1352 40.1440 72.0551 17.4398 8.2851 2.4105 24.3023 5.5297 0.4234 6.6378 11.8967 9.5611 10.0482 22.4569 147.8587 19.7492 125.2192 113.7880 242.3957 71.5126 21.7850 31.9801 3.6333 37.2702 87.6131 4.8765 1.1534 22.0425 22.6673 15.5159 40.8632 79.5419 54.9701 15.0391 10.5250 34.8564 19.8939 52.9684 68.1351
temp: 298.150 k
press: 1.00000 atm
elementType: 8 7 7 6 6 6 6 6 6 6 6 6 6 6 6 6 6 1 1 1 1 1 1 1 1 1 1 1 1 1 1 1 1 1 1 1 1
symmnumber: 1
zpe: 832485.8 jmol-1
zpe.correction: 0.317077 hartree
zpe.thermalcorrener: 0.333760 hartree
zpe.thermalcorrenthalpy: 0.334704 hartree
zpe.thermalcorrgfe: 0.271592 hartree
zpe.sumelectzpe: -728.951320 hartree
zpe.sumelectthermal: -728.934637 hartree
zpe.sumelectthermalent: -728.933693 hartree
zpe.sumelectthermalfe: -728.996805 hartree
dipole: 1.3306 2.3279 0.5324
dipole: 2.7337
quadrupole: -95.6893 -117.8040 -98.7191
quadrupole: -9.5656 -2.6010 -6.7473
quadrupole: 8.3815 -13.7331 5.3517 -9.5656 -2.6010 -6.7473
hfenergy: -729.2683975 hartree
pointgroup: C01 [X(C14H20N2O1)]
dipole: 0.5256675 -0.9340581 -0.0893627 debye
polarizability: 178.3957234|16.1959045|187.9068773|7.0879369|-21.9038559|128.2793032 unknown
InChI: InChI=1S/C14H20N2O/c1-2-3-8-16-10-12(14(15)17)9-11-6-4-5-7-13(11)16/h4-7,12H,2-3,8-10,15H2,1H3
charge 0 multiplicity 1
37 atoms
O  -1.981725 3.554055 0.295042
N  0.531896 0.653739 -0.150786
N  -2.55372 1.484509 1.175836
C  -1.571124 1.60212 -1.11916
C  -0.020648 1.585323 -1.152125
C  -2.079152 0.165306 -1.371402
C  -0.081805 -0.590046 0.06837
C  -1.38423 -0.862922 -0.482538
C  1.852485 0.979688 0.413646
C  3.055997 0.472724 -0.42316
C  -2.053509 2.292447 0.173914
C  0.53595 -1.60373 0.865966
C  -2.013923 -2.095315 -0.200653
C  4.41102 0.836676 0.224799
C  -0.11624 -2.825195 1.125825
C  -1.400874 -3.087035 0.597618
C  5.61968 0.36131 -0.609897
H  -1.907368 2.266663 -1.935863
H  0.305177 1.314168 -2.18073
H  0.358661 2.599143 -0.934005
H  -1.885485 -0.079154 -2.435773
H  -3.175829 0.108346 -1.239042
H  1.920281 0.581767 1.444671
H  1.916875 2.081455 0.504451
H  3.00324 0.911093 -1.440149
H  2.984131 -0.625661 -0.548465
H  1.534756 -1.444468 1.281796
H  -3.010338 -2.278963 -0.624279
H  4.464245 0.390999 1.239539
H  4.467913 1.935772 0.365408
H  0.389263 -3.578306 1.741592
H  -1.908284 -4.036058 0.79728
H  6.576222 0.630196 -0.12554
H  5.603592 -0.736908 -0.741139
H  5.610171 0.819009 -1.61692
H  -2.851007 1.926739 2.045591
H  -2.494291 0.465512 1.122785
