program: Gaussian 09
title: 000278869
version: EM64L-G09RevD.01
frameworkgroup: C1[X(C14H10N4)]
method: RPBEPBE
basis: SDD
operation: Freq
keyword: #pfreq=noraman
keyword: PBEPBE/SDD
title: #p freq=noraman PBEPBE/SDD
converged: NO YES NO NO
title: Mulliken charges:
elementType: N N N N C C C C C C C C C C C C C C H H H H H H H H H H
charge: -0.355871 -0.027143 -0.028083 -0.095507 0.334469 0.120900 0.011090 0.245722 -0.365447 -0.537505 0.026485 0.472809 -0.333041 -0.357021 -0.319983 -0.816960 -0.226375 -0.214021 0.264133 0.258733 0.233123 0.274695 0.264228 0.231915 0.231917 0.229304 0.237817 0.239616
chargesum: 0.00000
title: Mulliken charges with hydrogens summed into heavy atoms:
elementType: N N N N C C C C C C C C C C C C C C
charge: -0.355871 -0.027143 -0.028083 -0.095507 0.334469 0.120900 0.011090 0.245722 -0.101313 -0.278772 0.026485 0.472809 -0.099919 -0.082326 -0.055754 -0.123825 0.011442 0.025595
polarizability: 3.68196706e+02 6.09755540e+00 1.74732152e+02 -3.55456660e-03 3.00434127e-03 7.20521955e+01
1716.lowfreq: -7.1123 -5.4992 -0.0006 0.0003 0.0007 8.1747 55.4403 74.9575 92.4617
frequency: 55.4287 74.9251 92.4612 131.7140 137.2349 208.5405 225.6704 271.1614 302.5026 304.0473 368.5900 402.4002 422.2961 441.0903 484.3932 510.4823 511.1066 555.0714 570.6746 594.5146 609.7873 622.4060 671.7752 694.2260 739.0677 763.6982 765.4409 775.5720 782.9061 820.3744 834.7945 893.7331 894.0565 903.1928 930.5422 960.6412 975.9822 1003.0299 1004.1330 1013.0279 1023.1690 1048.0119 1078.9582 1098.8429 1129.2183 1141.1716 1165.3415 1179.6900 1213.7792 1243.2214 1267.1251 1286.1883 1313.0242 1335.4746 1389.9987 1395.8862 1398.2980 1425.8644 1439.1379 1450.7824 1462.5252 1470.1004 1491.5917 1557.8820 1563.5984 1591.9304 1623.2325 1636.4720 2976.8417 3054.0803 3088.5868 3131.3375 3141.2029 3155.6318 3156.7764 3169.4595 3174.0511 3178.7866
redmass: 3.9627 1.1166 4.2419 4.7238 4.2694 5.8815 5.1209 5.4183 3.6176 5.8517 5.0019 4.2652 3.4859 3.2728 8.1919 4.0985 6.9428 7.8123 8.1850 4.0273 4.0883 7.0323 6.3382 5.8466 6.6246 7.1948 4.2648 4.4759 1.3519 1.3880 7.8265 1.4602 1.4225 4.3466 4.0005 1.3315 1.3765 1.5711 1.3449 3.6310 3.3848 1.5499 4.7259 2.4094 2.6890 1.3527 1.4425 1.6209 2.3877 2.8150 2.4316 2.1519 3.0437 4.8085 3.8774 6.1988 1.2819 4.0307 2.7353 2.7917 1.6738 1.0457 1.8018 6.4507 8.0511 7.2096 7.4981 8.0330 1.0375 1.0975 1.0986 1.0895 1.0865 1.0903 1.0928 1.0957 1.0960 1.1002
irintensity: 2.7985 0.0274 1.7787 2.1998 0.0769 0.4013 3.1058 0.1073 0.3217 0.6383 0.6776 2.1751 0.0281 7.1666 6.3872 8.1614 0.3917 3.5208 3.9126 0.1439 13.0960 0.6208 2.6069 6.3589 8.1601 4.1572 1.2347 0.0272 83.5861 50.7261 25.4827 0.1342 6.9293 0.1365 14.9825 1.6105 2.8916 8.1439 0.0294 24.7827 68.3629 12.5666 70.1453 99.9934 6.2181 8.3679 0.8781 2.7140 40.7019 1.1139 0.5850 45.7125 2.6761 0.4968 5.3327 0.8443 14.3116 25.4901 30.0117 33.4533 16.6182 13.7434 8.4546 5.0537 34.1963 1.6195 5.0280 41.7836 42.3306 19.9613 17.3995 15.4302 3.0405 8.3414 8.0505 5.1287 5.3864 22.3143
temp: 298.150 k
press: 1.00000 atm
elementType: 7 7 7 7 6 6 6 6 6 6 6 6 6 6 6 6 6 6 1 1 1 1 1 1 1 1 1 1
symmnumber: 1
zpe: 550102.5 jmol-1
zpe.correction: 0.209523 hartree
zpe.thermalcorrener: 0.222694 hartree
zpe.thermalcorrenthalpy: 0.223639 hartree
zpe.thermalcorrgfe: 0.169638 hartree
zpe.sumelectzpe: -757.255436 hartree
zpe.sumelectthermal: -757.242264 hartree
zpe.sumelectthermalent: -757.241320 hartree
zpe.sumelectthermalfe: -757.295321 hartree
dipole: -0.3915 -1.4058 0.0010
dipole: 1.4593
quadrupole: -71.9116 -106.1464 -107.6990
quadrupole: 7.0798 -0.0011 -0.0003
quadrupole: 23.3407 -10.8941 -12.4467 7.0798 -0.0011 -0.0003
hfenergy: -757.4649586 hartree
pointgroup: C01 [X(C14H10N4)]
dipole: -0.1582608 0.5517299 -0.0132569 debye
polarizability: 368.278204|-4.6054798|174.596082|0.499998|-2.3541909|72.1067678 unknown
InChI: InChI=1S/C14H10N4/c1-9-6-7-13-12(8-9)15-14-10-4-2-3-5-11(10)16-17-18(13)14/h2-8H,1H3
charge 0 multiplicity 1
28 atoms
N  0.108277 -0.806461 0.022459
N  0.443582 1.473444 -0.029172
N  -0.565833 -2.052444 0.050102
N  -1.877833 -2.001329 0.04708
C  1.500017 -0.631912 0.020286
C  -0.48229 0.502297 -0.0082
C  1.686783 0.791641 -0.012045
C  -1.922631 0.523756 -0.010739
C  2.575363 -1.539568 0.042285
C  2.996147 1.325352 -0.022766
C  -2.575853 -0.756708 0.017551
C  4.094042 0.437124 -0.001228
C  3.866619 -0.979976 0.030984
C  -2.699615 1.711133 -0.039106
C  -3.994513 -0.828413 0.017027
C  5.520249 0.96058 -0.011534
C  -4.102158 1.622513 -0.039214
C  -4.751676 0.354067 -0.011197
H  2.411877 -2.62024 0.066707
H  3.143772 2.40954 -0.047336
H  4.736048 -1.648216 0.047349
H  -2.185763 2.676887 -0.060583
H  -4.461605 -1.817548 0.039035
H  6.075061 0.629007 0.886458
H  6.077105 0.588364 -0.89216
H  5.547256 2.062966 -0.036638
H  -4.703881 2.537406 -0.061088
H  -5.845247 0.30294 -0.011716
