program: Gaussian 09
title: 000278860
version: EM64L-G09RevD.01
frameworkgroup: C1[X(C14H11ClN2)]
method: RPBEPBE
basis: SDD
operation: Freq
keyword: #p
keyword: freq=noraman
keyword: PBEPBE/SDD
title: #p freq=noraman PBEPBE/SDD
converged: YES YES NO NO
title: Mulliken charges:
elementType: Cl N N C C C C C C C C C C C C C C H H H H H H H H H H H
charge: -0.089799 -0.448775 -0.082234 0.283777 -0.015088 0.103228 -0.569070 0.427911 0.495281 -0.338603 -0.354942 -0.288061 -0.343908 -0.820235 -0.235443 -0.239041 -0.228964 0.315269 0.241940 0.246654 0.228374 0.295352 0.231333 0.222704 0.231115 0.255893 0.236408 0.238925
chargesum: 0.00000
title: Mulliken charges with hydrogens summed into heavy atoms:
elementType: Cl N N C C C C C C C C C C C C C C
charge: -0.089799 -0.133506 -0.082234 0.283777 -0.015088 0.103228 -0.327130 0.427911 0.495281 -0.091949 -0.126568 -0.288061 -0.048556 -0.135083 0.020451 -0.002633 0.009960
polarizability: 3.36069366e+02 -9.78426588e+00 1.79395234e+02 -6.15156122e-03 6.72725890e-03 7.03216914e+01
1716.lowfreq: -6.4168 -2.6412 -0.0017 -0.0013 0.0014 3.8642 30.5563 57.7512 72.6109
frequency: 30.5180 57.7280 72.6064 100.9127 120.9799 174.2753 214.7189 226.7383 248.3519 289.7625 312.7476 360.4283 377.4150 413.6565 433.7605 456.9929 497.5179 522.3645 539.5294 604.6884 609.8139 642.9094 674.0826 683.8784 702.1516 734.1395 753.9182 770.5153 771.2897 823.3596 827.9653 870.8851 879.3078 928.7068 937.3866 961.7157 962.5946 1003.0150 1004.4644 1004.6257 1030.4549 1046.0587 1100.4286 1117.7846 1133.1364 1160.8185 1172.1032 1227.9009 1248.3179 1259.5773 1277.5396 1306.1593 1344.1791 1366.7547 1386.6414 1399.5323 1425.2613 1429.4487 1456.0147 1468.9226 1472.8667 1495.0768 1526.0618 1562.9187 1584.8617 1609.5785 1638.9599 2974.3373 3051.4058 3082.1736 3126.9082 3136.3152 3141.2520 3156.3389 3165.2007 3168.2943 3178.8946 3551.2389
redmass: 5.1236 3.6192 1.1335 5.7613 4.1825 4.6463 10.6914 5.0863 5.5081 4.3343 3.8837 4.9301 6.0970 5.9425 2.8932 3.4891 6.1790 4.1680 5.3946 3.1073 5.8714 6.6642 1.2250 4.4678 7.0188 3.3048 5.9212 1.5022 3.1045 1.4462 5.0785 1.4642 1.3744 7.8469 2.8849 1.3314 1.3563 6.5486 1.3426 1.5544 2.7503 1.5404 2.3113 1.7015 1.4512 2.1061 1.0588 2.0612 1.6175 1.7907 3.3011 2.1124 3.6670 7.4119 3.4124 1.2562 2.6944 2.7213 3.6141 1.0457 1.2359 3.0193 3.7413 6.1727 7.0600 7.1904 7.3734 1.0372 1.0976 1.0986 1.0888 1.0926 1.0862 1.0906 1.0960 1.0952 1.1001 1.0819
irintensity: 3.6065 0.3975 0.3576 2.5095 0.0153 0.9873 0.3856 0.8328 0.0534 6.0206 1.0631 3.0290 1.1897 12.1575 3.9845 15.8110 2.1035 0.2292 13.9931 1.4038 0.0373 6.7731 97.1077 0.0001 15.5175 13.3179 1.2170 63.9673 13.2697 59.2901 2.9686 10.5472 0.9624 0.3841 0.1559 0.6544 3.3316 42.7338 1.1853 10.2924 12.6587 13.4603 3.2318 2.6234 10.6750 0.6039 0.4406 2.7985 8.7977 59.7021 1.3689 18.7251 24.0938 15.4697 0.1925 7.5941 63.8270 39.9127 33.0775 12.9768 11.5973 1.9668 1.9480 9.8609 10.0958 15.2082 23.5539 48.6788 21.3588 19.2137 16.9367 14.8811 3.1607 6.7533 14.6244 4.5365 19.0143 117.0212
temp: 298.150 k
press: 1.00000 atm
elementType: 17 7 7 6 6 6 6 6 6 6 6 6 6 6 6 6 6 1 1 1 1 1 1 1 1 1 1 1
symmnumber: 1
zpe: 559745.5 jmol-1
zpe.correction: 0.213196 hartree
zpe.thermalcorrener: 0.227116 hartree
zpe.thermalcorrenthalpy: 0.228060 hartree
zpe.thermalcorrgfe: 0.171312 hartree
zpe.sumelectzpe: -1108.509995 hartree
zpe.sumelectthermal: -1108.496074 hartree
zpe.sumelectthermalent: -1108.495130 hartree
zpe.sumelectthermalfe: -1108.551878 hartree
dipole: 0.5500 1.3538 0.0034
dipole: 1.4613
quadrupole: -81.2549 -99.9995 -111.8012
quadrupole: -5.2748 -0.0043 -0.0007
quadrupole: 16.4303 -2.3143 -14.1160 -5.2748 -0.0043 -0.0007
hfenergy: -1108.7231905 hartree
pointgroup: C01 [X(C14H11Cl1N2)]
dipole: 0.1850773 -0.325566 0.4362015 debye
polarizability: 336.6224303|3.3875879|109.415505|1.747232|-52.0422882|139.7483567 unknown
InChI: InChI=1S/C14H11ClN2/c1-9-6-7-12-13(8-9)17-14(16-12)10-4-2-3-5-11(10)15/h2-8,17H,1H3
charge 0 multiplicity 1
28 atoms
Cl 2.111704 -1.504764 2.403185
N  -0.365377 -0.442877 0.925118
N  -0.180219 0.925366 -0.890687
C  -1.6753 -0.165176 0.526374
C  -1.536824 0.694894 -0.616463
C  0.505332 0.230062 0.050821
C  -2.931911 -0.564438 1.030063
C  1.976657 0.214126 0.107498
C  -4.084521 -0.087111 0.367791
C  -2.697187 1.16952 -1.274984
C  -3.948893 0.772307 -0.774169
C  2.804836 -0.467965 1.03785
C  2.657402 0.976237 -0.893961
C  -5.472588 -0.47351 0.849527
C  4.211214 -0.41221 0.997054
C  4.058291 1.046201 -0.954083
C  4.846292 0.350147 -0.005862
H  -0.06561 -1.024637 1.707832
H  -3.02337 -1.220699 1.902578
H  -2.608244 1.825359 -2.146224
H  -4.861677 1.127259 -1.267922
H  2.023732 1.503692 -1.613213
H  -6.035531 -1.009535 0.061852
H  -5.429772 -1.129389 1.73618
H  -6.066482 0.420041 1.120265
H  4.796579 -0.959261 1.741368
H  4.538176 1.641178 -1.737822
H  5.93949 0.395982 -0.040965
