program: Gaussian 09
title: 000278863
version: EM64L-G09RevD.01
frameworkgroup: C1[X(C13H10FN3O2)]
method: RPBEPBE
basis: SDD
operation: Freq
keyword: #p
keyword: freq=noraman
keyword: PBEPBE/SDD
title: #p freq=noraman PBEPBE/SDD
converged: YES YES NO NO
title: Mulliken charges:
elementType: F O O N N N C C C C C C C C C C C C C H H H H H H H H H H
charge: -0.192377 -0.212301 -0.226895 -0.113362 0.023435 -0.650718 0.351987 0.221028 0.147629 -0.512491 -0.362884 0.290152 -0.326882 0.354495 -0.365533 -0.285119 -0.373356 -0.268585 -0.203474 0.289383 0.281809 0.291733 0.268486 0.240105 0.225243 0.232147 0.228767 0.338043 0.309535
chargesum: 0.00000
title: Mulliken charges with hydrogens summed into heavy atoms:
elementType: F O O N N N C C C C C C C C C C C C C
charge: -0.192377 -0.212301 -0.226895 -0.113362 0.023435 -0.003140 0.351987 0.221028 0.147629 -0.223108 -0.081075 0.290152 -0.035150 0.354495 -0.097047 -0.045015 -0.148113 -0.036438 0.025292
polarizability: 4.37519132e+02 -1.41548546e+01 2.14666454e+02 -4.48892218e-01 5.02670157e+00 6.64966941e+01
1716.lowfreq: -12.0431 -0.0005 0.0003 0.0005 2.2681 2.8731 6.7509 12.8694 57.5704
frequency: -8.4515 12.7926 57.5507 62.5217 92.0524 116.9929 175.5857 181.5852 197.1391 218.1443 274.1711 305.6054 317.3128 345.9530 369.5776 399.3600 414.0220 445.3364 472.3662 482.5405 514.1132 535.4221 560.3558 582.1958 590.7088 598.2895 634.1375 638.4157 654.0138 720.8887 732.8900 747.3523 759.8548 766.0827 815.1120 827.1969 848.3240 863.2093 903.7164 941.3451 963.5154 968.4944 974.5855 978.4331 1000.3886 1042.1617 1053.4617 1101.0217 1137.2135 1150.9706 1170.7086 1183.1468 1193.9153 1229.7290 1259.4324 1277.2064 1318.0467 1333.7385 1366.2528 1394.8746 1407.2797 1428.6460 1450.2655 1460.7499 1490.0651 1520.5240 1566.1168 1579.2893 1585.3979 1613.3711 1622.2210 3120.7369 3126.5634 3138.5081 3149.4586 3169.4924 3178.4440 3186.1898 3197.0228 3519.7787 3687.8026
redmass: 5.1024 14.0967 6.3621 5.1654 7.3910 3.8701 8.5436 5.8056 3.9989 4.1053 9.4361 4.7776 5.2089 12.9216 4.3763 5.6939 1.2374 2.6613 2.9976 5.2927 5.9147 3.3179 6.9587 7.6466 5.7757 4.4650 1.1662 6.9825 4.6218 4.9153 7.0121 2.5088 1.5570 7.9857 5.2961 1.4625 1.5997 5.8247 1.4362 1.3849 1.6241 3.2293 1.3387 1.3222 1.8350 1.8740 4.8734 2.0541 1.5423 1.6346 1.3365 2.8910 2.7384 1.7052 2.4454 1.9424 2.7543 1.7833 3.8073 5.7291 4.5855 6.7105 2.5535 2.8976 2.8778 4.7254 6.6874 2.0060 2.8488 7.5325 3.9423 1.0889 1.0864 1.0874 1.0948 1.1003 1.0892 1.0910 1.0971 1.0458 1.1023
irintensity: 0.0562 0.1079 0.5763 0.6112 4.6517 1.5452 0.0787 4.2231 5.1281 2.5705 3.4897 1.9411 0.9560 1.6185 16.1846 0.6890 143.4641 19.6157 3.9511 2.2363 1.6993 13.2753 30.0621 14.3303 3.0482 0.8913 87.6464 4.6516 30.5836 3.2220 3.2914 31.9098 75.0134 6.3281 27.4463 39.2586 2.2118 1.8941 21.6836 1.3574 31.4301 37.8871 0.8830 4.7496 1.1043 5.1057 5.9707 88.8601 1.9455 58.8070 249.5294 419.9624 76.2832 42.9106 22.8893 90.8834 25.6543 54.2387 42.4164 240.5656 12.2572 35.9518 70.9030 84.7595 157.7234 235.9414 127.1718 63.9501 50.9506 88.3413 213.4886 24.6385 6.8730 8.4161 22.3989 40.2300 0.5376 4.9112 4.0663 47.7739 60.2204
temp: 298.150 k
press: 1.00000 atm
elementType: 9 8 8 7 7 7 6 6 6 6 6 6 6 6 6 6 6 6 6 1 1 1 1 1 1 1 1 1 1
symmnumber: 1
zpe: 547108.8 jmol-1
zpe.correction: 0.208383 hartree
zpe.thermalcorrener: 0.223698 hartree
zpe.thermalcorrenthalpy: 0.224642 hartree
zpe.thermalcorrgfe: 0.164206 hartree
zpe.sumelectzpe: -914.510835 hartree
zpe.sumelectthermal: -914.495520 hartree
zpe.sumelectthermalent: -914.494575 hartree
zpe.sumelectthermalfe: -914.555012 hartree
dipole: -3.2178 3.9555 0.0041
dipole: 5.0990
quadrupole: -88.8183 -115.5307 -112.8849
quadrupole: 2.6959 -0.9521 3.8384
quadrupole: 16.9263 -9.7860 -7.1403 2.6959 -0.9521 3.8384
hfenergy: -914.7192173 hartree
pointgroup: C01 [X(C13H10F1N3O2)]
dipole: 1.0273387 1.7231051 -0.0014195 debye
polarizability: 428.3298273|45.8417345|223.1426639|12.4088858|-6.7457604|67.2097887 unknown
InChI: InChI=1S/C13H10FN3O2/c14-10-5-6-13(17(18)19)9(7-10)8-16-12-4-2-1-3-11(12)15/h1-8H,15H2
charge 0 multiplicity 1
29 atoms
F  -3.449456 2.983669 0.028139
O  -3.298754 -3.313764 -0.090259
O  -1.048449 -3.023317 -0.165887
N  0.932866 0.540978 0.048804
N  -2.253606 -2.549066 -0.107642
N  2.527815 2.704189 -0.296325
C  -1.394914 -0.121523 0.001306
C  -2.465155 -1.082196 -0.062799
C  2.317673 0.3200 0.143121
C  -1.779067 1.252741 0.034697
C  0.043958 -0.436405 0.056581
C  3.140184 1.499299 -0.030642
C  -3.826044 -0.677196 -0.092845
C  -3.12264 1.617876 -0.002973
C  -4.175065 0.679523 -0.06567
C  2.954179 -0.930356 0.408812
C  4.559947 1.38179 0.068079
C  4.34935 -1.028912 0.50234
C  5.150225 0.136748 0.328348
H  -0.990233 2.005373 0.098518
H  0.310862 -1.498341 0.088697
H  -4.592076 -1.454184 -0.139044
H  -5.216487 1.009674 -0.090323
H  2.344218 -1.828198 0.556952
H  5.183707 2.273841 -0.0621
H  4.821874 -1.993148 0.713694
H  6.240961 0.062233 0.402484
H  1.508951 2.706588 -0.347219
H  3.058578 3.561784 -0.41444
