program: Gaussian 09
title: 000278864
version: EM64L-G09RevD.01
frameworkgroup: C1[X(C15H15N3O2)]
method: RPBEPBE
basis: SDD
operation: Freq
keyword: #p
keyword: freq=noraman
keyword: PBEPBE/SDD
title: #p freq=noraman PBEPBE/SDD
converged: YES YES NO NO
title: Mulliken charges:
elementType: O O N N N C C C C C C C C C C C C C C C H H H H H H H H H H H H H H H
charge: -0.217444 -0.232502 -0.104683 -0.656633 0.019657 0.366522 0.405757 0.104820 0.313689 -0.523097 -0.636303 -0.819888 -0.817806 0.312212 -0.370055 0.217066 -0.349612 -0.356070 -0.231459 -0.215330 0.241990 0.228876 0.224063 0.223506 0.239001 0.231198 0.230352 0.229589 0.279748 0.263294 0.305675 0.334579 0.285611 0.234166 0.239512
chargesum: 0.00000
title: Mulliken charges with hydrogens summed into heavy atoms:
elementType: O O N N N C C C C C C C C C C C C C C C
charge: -0.217444 -0.232502 -0.104683 -0.016379 0.019657 0.366522 0.405757 0.104820 0.313689 -0.281107 -0.407428 -0.133317 -0.126667 0.312212 -0.090308 0.217066 -0.086318 -0.070460 0.002707 0.024182
polarizability: 5.07745802e+02 -1.23387615e+01 2.37848314e+02 5.93951068e-01 -1.26528104e-02 8.30354364e+01
1716.lowfreq: -8.2366 -5.9201 -0.0004 -0.0002 0.0003 2.7140 10.4048 13.0424 48.8021
frequency: 4.9276 12.7163 48.8014 53.2385 88.8109 111.9900 120.0975 144.7457 168.4890 174.7325 182.7758 202.5013 245.6341 286.9515 290.0572 294.7047 318.8087 368.7361 379.3090 409.7365 413.1265 430.8089 452.0388 465.2850 506.9992 526.7246 534.8932 574.1454 614.6775 627.3439 639.3194 656.7058 661.1495 711.2912 727.0124 730.6091 759.6998 782.4582 783.7323 839.9978 860.2071 873.6228 887.7576 894.6480 963.6327 988.3640 990.0837 1004.1228 1007.2012 1029.1703 1035.8724 1051.3448 1052.7206 1057.0344 1101.1299 1128.3396 1164.3588 1179.6366 1187.0033 1215.8882 1235.6816 1266.0976 1287.8497 1316.5793 1320.1531 1369.1984 1388.5265 1393.1594 1402.1971 1408.1940 1431.3893 1435.5943 1459.9756 1462.2309 1472.9591 1473.4790 1480.2092 1506.4029 1514.9447 1558.4472 1574.9891 1585.7939 1607.5439 1634.1273 2966.1431 2972.0231 3036.5455 3044.8916 3083.1831 3087.3775 3118.5490 3120.5456 3133.7729 3139.0496 3159.6890 3174.1291 3189.1651 3517.7938 3690.0737
redmass: 5.2477 11.9093 4.1731 5.4974 3.6968 1.1300 3.1627 1.9526 1.6291 5.0288 5.9963 2.5446 3.4598 4.3655 4.1719 3.1631 3.1603 1.8200 9.0823 1.6407 4.7477 3.6346 5.9702 3.0195 5.9700 3.5108 5.1044 3.6920 5.7971 1.6211 1.8978 7.1418 4.7578 6.0287 3.6561 5.9322 2.9819 1.6787 3.7774 4.2445 1.5171 3.7119 1.5309 1.3745 1.6023 1.3674 1.4922 1.3466 1.4939 1.4431 2.8627 1.6347 1.6308 2.4806 4.2591 2.2075 1.7397 1.8618 3.2319 1.7490 1.9415 1.7701 1.9426 3.0915 3.1392 2.9607 4.1127 1.2448 2.2246 1.7246 2.6293 2.6505 1.0519 2.4302 1.3599 1.0889 1.2311 2.8342 4.0999 6.0668 3.2973 1.6518 6.1372 5.4981 1.0383 1.0378 1.0971 1.0964 1.0979 1.0982 1.0910 1.0893 1.0895 1.0869 1.0915 1.0949 1.0961 1.0458 1.1020
irintensity: 0.6916 0.2952 1.1598 1.0800 0.2031 0.0140 0.7665 7.5171 1.2999 4.9213 0.0717 0.1440 0.4725 0.1971 1.1451 0.3253 5.8008 37.9267 6.4166 137.2397 1.8838 5.0565 3.3586 6.2980 11.3426 11.2361 0.7792 0.9558 1.4608 48.7623 31.7946 2.8743 29.9441 2.1224 10.3277 26.7755 0.5866 52.2950 24.5376 5.6197 29.9905 3.0094 5.6338 0.0231 21.0479 8.1244 20.8314 0.7908 38.8943 18.9140 12.1585 0.1563 1.9311 4.2430 96.3677 36.8873 298.7878 207.7971 215.9131 29.0949 10.1028 1.3461 99.4732 224.3942 13.8537 32.8662 158.0495 10.3785 70.8932 2.7697 0.8743 0.5951 0.5847 121.8142 37.4789 32.4006 18.7881 132.3256 227.0847 93.8015 22.6814 171.9368 19.8977 119.4805 60.2379 45.5135 28.7004 13.7274 23.3766 12.4151 47.9562 10.7462 14.6588 4.7241 13.4688 14.2730 10.2735 43.2780 57.9666
temp: 298.150 k
press: 1.00000 atm
elementType: 8 8 7 7 7 6 6 6 6 6 6 6 6 6 6 6 6 6 6 6 1 1 1 1 1 1 1 1 1 1 1 1 1 1 1
symmnumber: 1
zpe: 711996.8 jmol-1
zpe.correction: 0.271185 hartree
zpe.thermalcorrener: 0.289952 hartree
zpe.thermalcorrenthalpy: 0.290896 hartree
zpe.thermalcorrgfe: 0.220773 hartree
zpe.sumelectzpe: -893.798903 hartree
zpe.sumelectthermal: -893.780137 hartree
zpe.sumelectthermalent: -893.779193 hartree
zpe.sumelectthermalfe: -893.849315 hartree
dipole: 3.5810 -5.5335 0.0946
dipole: 6.5918
quadrupole: -97.1443 -110.1934 -122.1303
quadrupole: 15.1447 -1.2952 0.6831
quadrupole: 12.6784 -0.3707 -12.3077 15.1447 -1.2952 0.6831
hfenergy: -894.0700886 hartree
pointgroup: C01 [X(C15H15N3O2)]
dipole: 1.2276474 -2.2842037 0.033704 debye
polarizability: 503.472451|-34.0447669|241.5426977|14.7130293|1.9885176|83.6144037 unknown
InChI: InChI=1S/C15H15N3O2/c1-10-7-13(16)14(8-11(10)2)17-9-12-5-3-4-6-15(12)18(19)20/h3-9H,16H2,1-2H3
charge 0 multiplicity 1
35 atoms
O  -4.136332 2.961607 -0.257044
O  -1.914361 2.715963 0.135899
N  0.146161 -0.815647 0.039783
N  1.792301 -2.967437 -0.045399
N  -3.095106 2.215685 -0.060918
C  3.536297 0.897088 0.223417
C  4.375251 -0.274695 0.180411
C  1.525593 -0.553676 0.085507
C  2.375242 -1.720584 0.043679
C  2.144118 0.730277 0.174245
C  3.788907 -1.548966 0.092678
C  4.146929 2.283519 0.323321
C  5.884086 -0.135061 0.229522
C  -2.199218 -0.200043 -0.001795
C  -0.767473 0.141105 0.038989
C  -3.283575 0.743153 -0.055956
C  -2.571201 -1.581831 -0.002908
C  -4.636732 0.318528 -0.10982
C  -3.906295 -2.004867 -0.049556
C  -4.953683 -1.047689 -0.104035
H  1.513121 1.625865 0.211479
H  4.432957 -2.436462 0.06047
H  4.752016 2.401301 1.243476
H  4.820139 2.498962 -0.529146
H  3.364891 3.061271 0.336322
H  6.383495 -1.117943 0.20017
H  6.261358 0.464015 -0.621661
H  6.211025 0.386241 1.14971
H  -0.519916 1.207545 0.069929
H  -1.752027 -2.304686 0.037074
H  2.343915 -3.819159 -0.071559
H  0.772897 -2.996323 -0.073164
H  -5.414344 1.084512 -0.155008
H  -4.140417 -3.074963 -0.043335
H  -6.00012 -1.366608 -0.139178
