program: Gaussian 09
title: 000278875
version: EM64L-G09RevD.01
frameworkgroup: C1[X(C11H15F3O5)]
method: RPBEPBE
basis: SDD
operation: Freq
keyword: #p
keyword: freq=noraman
keyword: PBEPBE/SDD
title: #p freq=noraman PBEPBE/SDD
converged: YES YES NO NO
title: Mulliken charges:
elementType: F F F O O O O O C C C C C C C C C C C H H H H H H H H H H H H H H H
charge: -0.159664 -0.148091 -0.143861 -0.286523 -0.279509 -0.120940 -0.188678 -0.176555 -0.002304 -0.402916 0.114435 0.230267 0.204860 -0.705742 0.338039 -0.254629 -0.256177 -0.662807 -0.660919 0.251019 0.238388 0.262514 0.219547 0.225508 0.237099 0.241144 0.240210 0.236601 0.247379 0.234442 0.225282 0.230735 0.246511 0.225337
chargesum: 0.00000
title: Mulliken charges with hydrogens summed into heavy atoms:
elementType: F F F O O O O O C C C C C C C C C C C
charge: -0.159664 -0.148091 -0.143861 -0.286523 -0.279509 -0.120940 -0.188678 -0.176555 -0.002304 0.086491 0.114435 0.230267 0.204860 0.001827 0.338039 0.223613 0.220633 0.044295 0.041665
polarizability: 1.62462384e+02 3.65992832e-02 1.30676838e+02 -6.54188559e-01 6.87852665e+00 1.20645872e+02
1716.lowfreq: -7.0950 -6.9218 -0.0001 0.0007 0.0007 7.9018 20.8240 33.8244 45.8223
frequency: 20.4291 33.8060 45.8154 55.6586 57.7968 66.6641 79.8761 84.9977 105.5315 109.9943 111.7479 147.3942 165.9645 192.6638 201.9501 214.3701 223.3384 225.6568 255.1712 269.6575 293.6918 300.5717 318.5009 344.5889 356.2821 411.1858 426.6385 436.0916 443.1105 449.2545 538.2109 614.0730 636.2994 676.2200 702.7745 723.1192 728.1096 753.9283 797.2010 808.0947 815.2436 824.8620 830.7387 939.9086 946.9316 1003.3063 1010.0646 1019.4666 1026.5569 1033.2627 1066.0157 1079.8524 1096.5956 1098.3405 1117.9134 1132.5431 1157.7935 1159.1085 1175.5562 1196.2923 1274.0838 1275.6107 1282.3130 1327.3715 1351.5711 1352.4081 1392.4695 1393.7011 1408.0063 1459.4212 1460.1961 1464.2902 1464.6622 1465.3072 1476.2042 1482.3589 1483.6513 1487.6139 1637.6783 1644.8558 1690.7251 2994.6437 2995.0402 2995.9962 3011.1989 3035.9768 3037.5436 3067.0739 3085.8565 3090.7247 3091.4685 3097.1182 3099.0236 3105.9754 3125.2243 3127.0296
redmass: 4.4007 3.5950 3.2531 6.0641 4.4072 6.2879 5.1395 2.3486 4.8531 3.5783 3.9837 4.2264 4.2669 1.8997 1.3393 1.3885 4.8899 9.6195 1.6271 8.6856 2.3780 3.4864 3.9511 8.7401 13.6400 3.7759 4.8702 11.8711 11.4460 3.6679 12.5585 6.3353 14.5289 5.8007 5.8158 4.1155 4.3491 2.3217 1.6343 1.6232 1.4053 2.6820 4.8172 2.5806 2.2675 2.6132 5.5886 3.5947 6.9101 9.4189 4.4936 2.8960 2.1726 2.2285 2.5502 6.7434 1.6665 1.7367 2.9125 11.0321 1.1195 1.1224 1.2367 1.3526 1.2658 1.2660 1.2299 1.2279 1.1995 1.0867 1.0842 1.0611 1.0451 1.0614 1.0402 1.0544 1.0517 1.0530 12.6696 10.7333 11.2830 1.0367 1.0360 1.0361 1.0611 1.0603 1.0602 1.1014 1.1001 1.0975 1.0975 1.1023 1.1024 1.1001 1.1069 1.1070
irintensity: 0.6728 2.2347 1.0440 0.5892 0.3389 0.3663 0.3664 0.2425 0.3466 0.2368 0.1318 0.4863 2.2872 0.4556 3.8526 1.5065 1.6830 1.7695 1.6802 2.5623 14.0560 6.4213 7.0326 9.0310 0.8408 0.5099 3.5849 5.6240 6.7954 7.4187 1.4231 1.7472 24.8959 4.6869 5.1278 14.1918 4.6462 13.0229 2.5345 4.9271 10.9269 11.2034 24.4970 4.5827 3.0292 16.7637 23.8647 322.0642 87.5102 173.4271 29.7679 583.2587 23.7534 20.3592 3.1615 115.4173 31.9776 24.1368 146.3077 5.9774 4.8242 6.8085 10.4708 2.8132 0.2609 1.0406 22.8299 25.0681 28.6914 12.4127 4.2456 5.3401 35.1844 9.2414 9.6105 6.3230 10.9425 16.2564 287.2399 15.8426 154.6941 18.0058 20.7688 13.9282 7.0924 19.3322 21.5687 2.7731 36.9713 27.6745 30.5411 3.6296 3.3573 16.6172 21.2489 20.9232
temp: 298.150 k
press: 1.00000 atm
elementType: 9 9 9 8 8 8 8 8 6 6 6 6 6 6 6 6 6 6 6 1 1 1 1 1 1 1 1 1 1 1 1 1 1 1
symmnumber: 1
zpe: 660285.9 jmol-1
zpe.correction: 0.251490 hartree
zpe.thermalcorrener: 0.273371 hartree
zpe.thermalcorrenthalpy: 0.274316 hartree
zpe.thermalcorrgfe: 0.198718 hartree
zpe.sumelectzpe: -1102.318524 hartree
zpe.sumelectthermal: -1102.296642 hartree
zpe.sumelectthermalent: -1102.295698 hartree
zpe.sumelectthermalfe: -1102.371296 hartree
dipole: -0.1899 -1.3498 0.5323
dipole: 1.4634
quadrupole: -81.9364 -119.8560 -118.2921
quadrupole: -1.0603 -1.6930 -11.0204
quadrupole: 24.7585 -13.1612 -11.5973 -1.0603 -1.6930 -11.0204
hfenergy: -1102.5700137 hartree
pointgroup: C01 [X(C11H15F3O5)]
dipole: -0.0510107 -0.534637 0.2074332 debye
polarizability: 162.3936658|1.4375742|130.6849136|-1.0647764|6.8797814|120.7065144 unknown
InChI: InChI=1S/C11H15F3O5/c1-4-10(8(16)18-5-2,9(17)19-6-3)7(15)11(12,13)14/h4-6H2,1-3H3
charge 0 multiplicity 1
34 atoms
F  -0.028361 1.706475 -1.218106
F  -1.059784 2.865664 0.439356
F  1.192327 2.885395 0.293186
O  2.223683 0.148842 -0.089629
O  -2.207772 0.088098 0.186496
O  0.230464 1.045074 2.329743
O  1.558229 -1.890772 -1.010338
O  -1.369995 -1.356853 -1.449399
C  0.036444 -0.592507 0.485821
C  -0.090816 -1.647224 1.653083
C  0.124769 0.822572 1.110143
C  1.320621 -0.886226 -0.318809
C  -1.218822 -0.691532 -0.412358
C  -0.380323 -3.089124 1.195274
C  0.062775 2.063207 0.151627
C  3.576603 0.054859 -0.733891
C  -3.542419 0.154897 -0.496279
C  4.528375 -0.769111 0.134808
C  -4.432682 -1.00695 -0.052147
H  -0.889684 -1.284145 2.324021
H  0.847903 -1.605173 2.235673
H  0.374013 -3.452271 0.477929
H  -0.376699 -3.757094 2.075279
H  -1.368514 -3.176669 0.710109
H  3.887154 1.10777 -0.81669
H  3.446469 -0.386551 -1.737195
H  -3.370263 0.146814 -1.586636
H  -3.936839 1.132829 -0.179761
H  4.199553 -1.820005 0.196196
H  4.594215 -0.350353 1.153455
H  5.540075 -0.751926 -0.310704
H  -4.544255 -1.021867 1.045579
H  -4.019036 -1.972992 -0.386981
H  -5.43771 -0.89125 -0.498257
