program: Gaussian 09
title: 000278861
version: EM64L-G09RevD.01
frameworkgroup: C1[X(C17H13N3)]
method: RPBEPBE
basis: SDD
operation: Freq
keyword: #pfreq=noraman
keyword: PBEPBE/SDD
title: #p freq=noraman PBEPBE/SDD
converged: YES YES NO NO
title: Mulliken charges:
elementType: N N N C C C C C C C C C C C C C C C C C H H H H H H H H H H H H H
charge: -0.451033 -0.182012 -0.693267 -0.135139 0.246484 0.273334 0.177300 0.440546 -0.383876 0.220593 -0.456196 -0.418343 -0.444588 0.288105 -0.329715 -0.243740 -0.244418 -0.410681 -0.302961 -0.211211 0.312738 0.234506 0.238010 0.255121 0.239093 0.182127 0.226940 0.225871 0.214531 0.225055 0.223556 0.392847 0.290424
chargesum: 0.00000
title: Mulliken charges with hydrogens summed into heavy atoms:
elementType: N N N C C C C C C C C C C C C C C C C C
charge: -0.138294 -0.182012 -0.009996 -0.135139 0.246484 0.273334 0.177300 0.440546 -0.149371 0.220593 -0.218186 -0.163223 -0.205495 0.288105 -0.147588 -0.016801 -0.018547 -0.196150 -0.077905 0.012345
polarizability: 4.08260113e+02 -8.44743187e+00 2.30825842e+02 1.26969025e-02 9.70120470e-03 7.79905374e+01
1716.lowfreq: -9.6279 -0.0009 0.0005 0.0006 4.4594 10.7950 38.1958 53.1361 89.3483
frequency: 38.1850 53.1306 89.3483 122.3208 147.4545 185.1229 213.6004 249.2144 265.8151 286.0276 342.9853 374.1502 423.0190 437.2803 442.2684 465.3965 473.5921 499.4030 520.0158 537.1084 538.2215 562.1403 573.1029 583.4426 625.0993 655.5412 688.0540 708.5958 713.8200 740.7630 750.8115 754.4449 757.7347 806.9268 814.6527 829.5353 837.4961 854.5040 874.6689 885.9999 916.9998 932.1609 945.0356 965.6280 967.6231 991.6814 1008.2297 1026.4765 1037.6911 1051.3923 1079.3614 1093.0919 1143.3013 1160.6986 1171.6130 1176.1863 1199.6785 1228.2954 1241.7722 1274.8804 1279.7411 1322.3699 1325.0578 1342.2152 1377.5482 1398.4253 1401.8497 1429.4463 1438.5847 1451.8802 1457.3174 1495.8188 1522.7110 1543.3209 1563.8279 1576.8062 1600.2385 1614.4442 1630.6327 1638.7349 3108.1033 3118.7588 3119.6722 3129.0953 3132.6100 3141.9963 3149.4406 3153.5286 3164.2498 3165.9314 3211.6823 3610.7625 3629.5256
redmass: 4.3064 5.2518 5.2189 4.4539 4.7307 4.5180 5.3087 4.2490 5.9131 4.6468 4.6073 4.8648 2.9651 4.6246 1.4390 2.0287 4.7367 6.7124 3.4771 5.5450 3.2072 5.9578 3.2718 1.2269 6.0079 6.4006 4.1997 3.7865 5.7291 1.7402 1.8835 6.4787 1.4221 3.0542 1.5401 5.3804 1.6707 1.1216 4.8007 1.7051 1.3882 9.2045 1.3459 1.3214 1.4056 1.3379 4.9853 2.7729 2.4275 2.4942 1.8918 2.1144 1.2754 1.3154 1.0774 1.0629 2.0771 1.7410 1.7217 1.9461 2.0535 4.0676 4.3575 1.6962 2.6775 6.1459 4.0910 2.7121 3.9555 2.6585 3.4665 3.4515 4.4777 4.5348 3.3374 5.6381 5.1681 1.9177 4.2637 6.6849 1.0872 1.0866 1.0872 1.0871 1.0885 1.0932 1.0944 1.0977 1.1001 1.0997 1.0669 1.0808 1.0871
irintensity: 0.8298 1.9311 0.6690 0.1449 6.2826 1.3289 7.2291 1.9493 3.5187 0.3576 2.1875 1.3102 0.1793 3.2889 117.0883 19.6378 16.5134 1.4650 0.2055 6.2725 0.3875 0.0875 3.9268 96.7026 9.0887 2.8615 3.7402 21.5160 0.4796 64.6334 25.6947 3.9752 57.9256 1.8118 97.4712 4.4717 32.0858 79.7638 8.3925 0.9996 1.4646 1.4907 0.2373 0.3583 4.8974 0.0653 14.9075 8.3784 2.4465 0.8044 18.1240 21.8116 0.7065 13.9732 0.0847 15.2624 4.8774 5.5913 15.7939 15.2984 1.3809 27.3575 3.3961 19.3356 75.4205 63.7875 52.6858 0.3381 6.8220 13.2289 7.5350 65.9580 91.9475 22.4078 8.5124 5.0279 27.5695 118.9485 123.3398 11.4699 18.9705 3.3231 5.2708 0.5134 10.1643 32.0302 29.1572 30.0793 35.1963 33.7683 268.4711 38.2259 53.7238
temp: 298.150 k
press: 1.00000 atm
elementType: 7 7 7 6 6 6 6 6 6 6 6 6 6 6 6 6 6 6 6 6 1 1 1 1 1 1 1 1 1 1 1 1 1
symmnumber: 1
zpe: 679354.0 jmol-1
zpe.correction: 0.258752 hartree
zpe.thermalcorrener: 0.273438 hartree
zpe.thermalcorrenthalpy: 0.274382 hartree
zpe.thermalcorrgfe: 0.216952 hartree
zpe.sumelectzpe: -818.568328 hartree
zpe.sumelectthermal: -818.553643 hartree
zpe.sumelectthermalent: -818.552699 hartree
zpe.sumelectthermalfe: -818.610129 hartree
dipole: -0.5049 1.3114 -0.0010
dipole: 1.4052
quadrupole: -102.4291 -91.4260 -125.8576
quadrupole: 1.7831 0.0120 0.0107
quadrupole: 4.1418 15.1449 -19.2867 1.7831 0.0120 0.0107
hfenergy: -818.8270806 hartree
pointgroup: C01 [X(C17H13N3)]
dipole: -0.1976513 0.5160613 0.0164162 debye
polarizability: 408.2147392|-8.7294807|230.7155554|-2.2353926|4.6883418|78.1461978 unknown
InChI: InChI=1S/C17H13N3/c18-14-8-4-3-7-13(14)17-19-15-10-9-11-5-1-2-6-12(11)16(15)20-17/h1-10,19H,18H2
charge 0 multiplicity 1
33 atoms
N  -0.632808 1.691697 0.032987
N  -0.240655 -0.543455 -0.037116
N  -2.293497 -2.259296 -0.075156
C  0.983631 0.138865 -0.023611
C  0.7591 1.543257 0.020702
C  2.319255 -0.384034 -0.046826
C  -1.215409 0.413541 -0.001601
C  3.401549 0.581543 -0.022578
C  1.815342 2.494298 0.044781
C  -2.653611 0.168233 0.000025
C  3.120142 1.997017 0.022668
C  2.618004 -1.779952 -0.0914
C  4.749409 0.095863 -0.044446
C  -3.159785 -1.186425 -0.037138
C  -3.586166 1.24498 0.038238
C  3.946516 -2.219724 -0.111648
C  5.020114 -1.275774 -0.087995
C  -4.576155 -1.386903 -0.033218
C  -4.974082 1.030438 0.041105
C  -5.464843 -0.302592 0.00503
H  -1.137746 2.573973 0.062975
H  1.62034 3.571171 0.078887
H  3.966896 2.692858 0.039917
H  1.788017 -2.49357 -0.109279
H  5.572503 0.820567 -0.026392
H  -3.222916 2.280586 0.065907
H  4.169642 -3.291881 -0.145901
H  6.055986 -1.632199 -0.104151
H  -4.960688 -2.413863 -0.060956
H  -5.666554 1.877239 0.070937
H  -6.544971 -0.488027 0.007271
H  -1.277375 -2.047933 -0.075344
H  -2.655288 -3.209097 -0.103576
