program: Gaussian 09
title: 000278927
version: EM64L-G09RevD.01
frameworkgroup: C1[X(C18H28Cl2N2O)]
method: RPBEPBE
basis: SDD
operation: Freq
keyword: #p
keyword: freq=noraman
keyword: PBEPBE/SDD
title: #p freq=noraman PBEPBE/SDD
converged: YES YES NO NO
title: Mulliken charges:
elementType: Cl Cl O N N C C C C C C C C C C C C C C C C C C H H H H H H H H H H H H H H H H H H H H H H H H H H H H
charge: -0.061276 -0.061318 -0.276201 -0.172403 -0.384536 -0.577352 -0.372204 -0.023196 0.512573 -0.526384 -0.391706 0.440923 0.254642 -0.455284 -0.422262 -0.390680 -0.388901 -0.374442 -0.373029 -0.683624 -0.711379 -0.583802 -0.585598 0.215851 0.203776 0.210093 0.248487 0.199253 0.223813 0.220311 0.214150 0.253877 0.247845 0.246929 0.249040 0.247428 0.232439 0.233191 0.295150 0.229803 0.230046 0.206896 0.227271 0.213323 0.202303 0.211477 0.223956 0.268033 0.293469 0.267785 0.291445
chargesum: 0.00000
title: Mulliken charges with hydrogens summed into heavy atoms:
elementType: Cl Cl O N N C C C C C C C C C C C C C C C C C C
charge: -0.061276 -0.061318 -0.276201 -0.172403 -0.089385 -0.157725 0.086376 0.176057 0.512573 -0.082259 0.076321 0.440923 0.254642 -0.222845 -0.189071 0.104094 0.107567 -0.144639 -0.142982 -0.036135 -0.073643 -0.022300 -0.026368
polarizability: 2.70420671e+02 -2.34871851e+01 2.31690194e+02 -3.29032544e+01 -7.68012415e+00 2.13158397e+02
1716.lowfreq: -13.6352 -6.2076 -2.7182 -0.0020 -0.0016 -0.0015 6.4587 9.4027 16.7969
frequency: 3.3793 9.2478 16.3628 26.2054 28.5453 35.7978 43.3868 44.8559 56.6474 59.6424 95.6645 105.4233 125.0445 134.4735 149.3815 170.9603 190.3323 206.1101 217.3821 234.7073 241.4530 246.6348 254.4323 269.8516 286.3752 343.9232 361.4675 367.2650 367.9578 377.2212 405.6912 414.7685 450.5165 506.4243 526.0399 526.6142 554.5676 598.6299 617.0779 636.0775 652.5031 686.1148 691.4092 701.3528 724.9903 770.5117 780.6482 783.4632 789.5965 797.8923 814.7765 827.1342 842.0588 876.5805 910.7416 937.5353 945.5843 950.8985 952.7126 957.5799 969.3451 981.9325 997.6599 1000.3935 1022.4555 1029.3448 1034.1951 1035.8135 1041.5378 1079.5429 1117.4907 1120.7217 1125.2979 1142.4972 1148.4422 1177.6973 1183.4373 1192.5259 1202.4934 1223.1165 1223.9639 1230.5006 1254.1031 1255.0899 1255.3080 1269.7488 1276.2686 1294.4786 1302.2677 1312.1798 1317.5452 1329.8655 1330.8065 1352.2170 1354.1373 1356.7411 1361.0507 1372.4348 1375.7939 1385.2377 1395.6622 1424.3462 1445.4366 1453.1599 1457.3754 1458.5365 1462.0973 1468.8717 1471.8597 1472.9082 1481.3119 1481.6461 1484.5477 1493.9606 1502.9749 1515.7000 1569.3294 1617.3023 1629.6389 2965.6979 2966.5880 2970.6575 2975.7307 2978.4448 2984.0038 2988.1294 3010.8492 3015.8770 3028.8047 3031.8758 3057.6281 3062.7535 3062.9683 3063.1078 3066.4647 3067.2340 3069.6504 3072.6611 3074.2282 3083.4015 3115.1032 3117.7253 3147.4331 3148.2583 3151.6514 3156.5650 3554.1310
redmass: 6.3252 4.9022 4.4334 4.9408 11.7866 5.7498 5.2111 4.8395 3.3893 3.5660 2.8982 2.5969 2.7638 2.6641 3.9105 3.3453 1.1267 5.7530 5.8592 3.5099 2.9744 1.2516 3.1613 4.5768 3.3969 3.5681 2.2492 2.8615 2.1768 2.5985 2.7651 3.0644 3.6686 2.8983 1.8162 3.7547 2.6294 1.4895 2.7680 6.7819 5.4769 3.2506 5.1508 3.9517 2.8881 2.2582 1.1278 3.3892 1.1991 2.1558 1.2524 1.7758 2.1636 1.9147 1.2779 1.4078 1.5513 2.0517 1.9292 1.6338 2.1157 2.5234 1.4212 2.7109 2.2958 2.1351 3.0078 2.7429 1.9988 2.3221 1.6440 1.6359 1.4455 1.4840 1.7068 1.6953 1.5297 1.7044 1.2033 2.0543 1.8696 1.6627 1.1638 1.1625 1.1469 1.2632 1.3678 1.1971 1.4895 1.3581 1.5320 1.4693 1.4155 1.4711 1.2833 1.4469 1.3298 4.5639 1.2281 1.7236 1.2241 3.0971 1.1002 1.1024 1.0948 1.0948 1.0624 1.0923 1.1039 1.0552 1.3362 1.0992 1.1096 1.2305 1.1264 2.5239 6.4784 6.1476 6.3643 1.0773 1.0366 1.0602 1.0600 1.0383 1.0679 1.0637 1.0601 1.0609 1.0978 1.0999 1.0992 1.0580 1.0625 1.1001 1.0976 1.0996 1.0992 1.1031 1.0989 1.0996 1.0887 1.0885 1.1105 1.1117 1.0945 1.0942 1.0772
irintensity: 0.1753 0.4079 1.3772 0.0649 0.9563 2.8523 0.8318 4.6639 0.2139 0.9682 3.5007 3.5184 1.6059 1.5557 5.0874 0.1101 1.2155 3.2795 0.0647 3.0850 14.5868 0.1903 4.8889 8.0767 0.4005 6.0207 0.3515 6.7140 0.3812 5.7260 1.4466 0.3244 3.4475 5.5206 67.5802 5.8464 22.5723 47.2885 16.3121 1.9880 29.1747 27.6514 93.1646 20.1325 4.6682 2.8852 3.5506 4.9957 8.6133 32.7689 0.3068 36.0430 6.2200 7.5114 1.6208 1.2835 2.4982 17.4940 1.7791 6.8567 1.3291 2.0421 3.5289 0.1006 7.7810 6.1392 0.6819 0.9371 0.5529 2.9785 12.8438 21.6378 21.5260 6.3564 19.0271 69.1271 4.4988 2.2297 6.6815 36.6270 25.1247 20.3002 15.6148 23.3287 37.5651 12.1836 41.1774 8.3480 4.5021 9.7535 28.6991 10.2231 10.5462 42.2200 2.6396 45.7805 4.4018 4.0653 22.9817 41.1257 16.0336 3.0252 12.6122 24.9794 14.8599 7.4180 13.6654 21.3180 6.0565 5.1750 49.6955 45.0976 79.0681 84.7011 0.6543 272.0295 5.7653 152.4813 109.5660 9.0143 33.4376 11.0751 44.8708 45.7968 55.9751 19.6439 27.1749 14.0772 5.9313 27.1772 46.1439 6.7573 18.7563 50.7543 2.6048 14.1298 13.2774 11.2695 95.1389 33.0074 9.7033 31.2313 1.1624 20.2847 34.2528 8.0393 9.3084
temp: 298.150 k
press: 1.00000 atm
elementType: 17 17 8 7 7 6 6 6 6 6 6 6 6 6 6 6 6 6 6 6 6 6 6 1 1 1 1 1 1 1 1 1 1 1 1 1 1 1 1 1 1 1 1 1 1 1 1 1 1 1 1
symmnumber: 1
zpe: 1130534.4 jmol-1
zpe.correction: 0.430598 hartree
zpe.thermalcorrener: 0.457044 hartree
zpe.thermalcorrenthalpy: 0.457988 hartree
zpe.thermalcorrgfe: 0.365392 hartree
zpe.sumelectzpe: -1805.789885 hartree
zpe.sumelectthermal: -1805.763439 hartree
zpe.sumelectthermalent: -1805.762495 hartree
zpe.sumelectthermalfe: -1805.855091 hartree
dipole: -1.1376 1.8420 1.2743
dipole: 2.5121
quadrupole: -180.9923 -165.2437 -155.4132
quadrupole: 12.0336 15.9138 4.3637
quadrupole: -13.7759 1.9727 11.8032 12.0336 15.9138 4.3637
hfenergy: -1806.2204828 hartree
pointgroup: C01 [X(C18H28Cl2N2O1)]
dipole: -0.343041 -0.9242186 0.0705447 debye
polarizability: 261.323985|43.8074783|226.4255189|11.4210594|-10.1893953|227.5197583 unknown
InChI: InChI=1S/C18H28Cl2N2O/c1-15(2)14-21-18(23)5-3-4-16-6-8-17(9-7-16)22(12-10-19)13-11-20/h6-9,15,21H,3-5,10-14H2,1-2H3
charge 0 multiplicity 1
51 atoms
Cl -5.958012 -0.295246 -3.255353
Cl -4.232875 -3.631811 3.127913
O  4.958851 1.703717 0.480511
N  -3.654839 -0.780035 0.166302
N  4.270523 -0.522744 0.513378
C  0.747406 2.975654 0.926151
C  2.10459 2.462562 0.370713
C  5.611798 -1.702805 -1.291315
C  -0.406472 1.999587 0.739098
C  2.63373 1.221046 1.124097
C  5.578475 -1.083431 0.134342
C  -2.583745 0.130056 0.354245
C  4.048964 0.838469 0.672829
C  -0.945961 1.256671 1.817407
C  -0.982853 1.782731 -0.538566
C  -4.225714 -1.026295 -1.167509
C  -4.257491 -1.495242 1.302295
C  -2.00263 0.33922 1.640825
C  -2.044267 0.87859 -0.736444
C  5.338399 -0.636865 -2.376004
C  4.642369 -2.902584 -1.421394
C  -5.276489 0.043627 -1.522438
C  -3.456823 -2.769564 1.63239
H  0.509786 3.932659 0.420839
H  0.868135 3.209272 2.002468
H  1.997777 2.223454 -0.70581
H  2.866407 3.260218 0.444917
H  6.646439 -2.08364 -1.426973
H  2.684118 1.458141 2.206933
H  1.932302 0.371946 1.012793
H  5.871538 -1.852068 0.877619
H  6.297589 -0.247651 0.198372
H  -3.43577 -1.047679 -1.939241
H  -4.705384 -2.021079 -1.180939
H  -4.316307 -0.845921 2.193975
H  -5.295085 -1.776355 1.048927
H  -0.534093 1.396844 2.824895
H  -0.603598 2.344545 -1.401801
H  3.492178 -1.163339 0.675884
H  -2.367935 -0.205559 2.516803
H  -2.454537 0.772928 -1.745429
H  5.399038 -1.078082 -3.388067
H  6.064525 0.193103 -2.312291
H  4.328207 -0.204518 -2.251162
H  3.587963 -2.573193 -1.342039
H  4.827913 -3.664463 -0.639918
H  4.7558 -3.39425 -2.404812
H  -6.145532 0.015504 -0.848339
H  -4.849641 1.055953 -1.558549
H  -3.485964 -3.503941 0.813756
H  -2.418205 -2.549137 1.917014
