program: Gaussian 09
title: 000278850
version: EM64L-G09RevD.01
frameworkgroup: C1[X(C12H10N4O2)]
method: RPBEPBE
basis: SDD
operation: Freq
keyword: #p
keyword: freq=noraman
keyword: PBEPBE/SDD
title: #p freq=noraman PBEPBE/SDD
converged: NO YES NO YES
title: Mulliken charges:
elementType: O O N N N N C C C C C C C C C C C C H H H H H H H H H H
charge: -0.190208 -0.190208 -0.171682 -0.171682 -0.009980 -0.009982 0.094767 0.094767 0.078780 0.078779 0.081907 0.081906 -0.615747 -0.615747 -0.329053 -0.329053 -0.220306 -0.220306 0.254802 0.254796 0.271219 0.254800 0.271219 0.254798 0.262666 0.262666 0.238041 0.238041
chargesum: 0.00000
title: Mulliken charges with hydrogens summed into heavy atoms:
elementType: O O N N N N C C C C C C C C C C C C
charge: -0.190208 -0.190208 -0.171682 -0.171682 -0.009980 -0.009982 0.094767 0.094767 0.078780 0.078779 0.081907 0.081906 0.165070 0.165070 -0.066387 -0.066387 0.017735 0.017735
polarizability: 3.22675329e+02 1.61813453e-05 1.66474171e+02 2.08337785e-02 -8.89061791e-03 6.98090258e+01
1716.lowfreq: -9.5683 -2.7344 -0.0010 -0.0007 0.0005 7.0950 55.8365 62.7004 95.0532
frequency: 55.8365 62.6976 95.0502 107.4206 136.6549 137.8847 176.3167 205.4009 235.0634 291.3836 330.1057 343.6193 358.5509 359.3403 373.7213 388.5276 435.3117 473.4092 484.3314 490.9714 534.4198 555.3166 576.6150 594.8434 631.3186 646.8269 717.3731 758.4368 760.8586 766.7564 775.0056 787.8289 882.3101 896.8051 933.8617 967.2179 969.6959 995.6978 1011.8988 1028.3096 1069.9697 1114.6359 1123.6610 1123.8868 1154.3725 1171.7739 1211.9068 1260.1603 1262.3668 1277.8078 1308.4885 1349.0502 1369.8994 1381.5053 1408.6942 1419.9761 1459.8907 1466.7114 1470.6335 1473.2489 1473.2928 1481.9448 1485.8456 1522.6381 1550.3361 1610.9819 1611.0477 1618.9360 3018.5810 3018.7965 3111.8711 3111.8971 3138.3045 3146.9246 3146.9816 3151.4192 3165.4608 3175.4164
redmass: 6.5668 6.1728 4.7811 3.6722 1.0524 1.0351 4.6355 5.0449 4.9801 3.3704 5.5435 3.9502 8.6263 5.2350 5.8630 6.7079 6.1558 9.9947 5.1650 5.5464 7.6306 3.7971 7.6704 8.0254 11.3162 6.5975 7.4095 11.1433 5.9833 5.4214 1.2879 4.2700 1.5798 6.7451 2.9064 1.3602 7.7352 1.3249 2.1404 6.5230 1.9734 1.7290 1.3209 1.3149 1.4129 1.6360 2.4991 1.9803 4.7593 7.7085 5.4967 2.6363 5.5934 3.3500 1.6898 1.2394 1.7608 1.9984 2.4683 1.0438 1.0431 1.5008 1.8746 9.8563 6.9156 9.9285 10.9655 7.0182 1.0327 1.0327 1.1018 1.1019 1.0860 1.1028 1.1028 1.0896 1.0957 1.1006
irintensity: 0.0000 4.2770 0.0000 6.4686 0.0554 0.0000 0.1304 1.4500 0.0000 0.7437 0.0000 0.9969 0.3094 1.1894 11.8954 6.9205 3.4136 4.6281 2.1582 0.9255 34.8021 0.0000 0.5533 10.6063 0.7516 10.8074 0.0000 0.0002 6.0687 0.0628 98.2426 0.0000 0.0000 0.0061 0.4076 2.7200 0.5511 0.0000 10.2985 2.5717 10.6651 2.1356 0.2221 0.0000 82.9318 46.1948 6.4648 3.4589 46.0272 49.1201 156.0487 9.0915 87.8796 4.0828 0.6672 72.7233 0.1552 27.6047 269.4349 40.0886 0.0009 2.6840 49.4241 78.5293 33.0629 16.7673 826.8326 0.2051 30.0814 0.0720 25.3126 0.2073 1.6811 2.4225 0.2877 5.6281 12.5359 27.7311
temp: 298.150 k
press: 1.00000 atm
elementType: 8 8 7 7 7 7 6 6 6 6 6 6 6 6 6 6 6 6 1 1 1 1 1 1 1 1 1 1
symmnumber: 1
zpe: 542819.4 jmol-1
zpe.correction: 0.206749 hartree
zpe.thermalcorrener: 0.221390 hartree
zpe.thermalcorrenthalpy: 0.222334 hartree
zpe.thermalcorrgfe: 0.165192 hartree
zpe.sumelectzpe: -831.505748 hartree
zpe.sumelectthermal: -831.491107 hartree
zpe.sumelectthermalent: -831.490163 hartree
zpe.sumelectthermalfe: -831.547306 hartree
dipole: -6.4202 0.0000 -0.0015
dipole: 6.4202
quadrupole: -120.5003 -93.6069 -104.0033
quadrupole: 0.0000 -0.0069 -0.0009
quadrupole: -14.4634 12.4299 2.0335 0.0000 -0.0069 -0.0009
hfenergy: -831.7124974 hartree
pointgroup: C01 [X(C12H10N4O2)]
dipole: 2.5258866 -0.0000023 -0.0005827 debye
polarizability: 322.6753288|-0.0001944|166.4741714|-0.0208338|0.0088906|69.8090258 unknown
InChI: InChI=1S/C12H10N4O2/c1-15-9-10(16(2)12(18)11(15)17)14-8-6-4-3-5-7(8)13-9/h3-6H,1-2H3
charge 0 multiplicity 1
28 atoms
O  -3.937103 1.402283 0.000752
O  -3.937107 -1.402279 0.000635
N  -1.597963 1.424493 0.000117
N  -1.597966 -1.424495 0.000091
N  0.760435 1.432234 0.000128
N  0.760431 -1.432243 -0.000213
C  -0.379065 0.727682 0.000034
C  -0.379067 -0.727687 -0.000106
C  -2.851421 0.770718 -0.000284
C  -2.851423 -0.770716 0.000232
C  1.955865 0.72442 -0.000002
C  1.955863 -0.724431 -0.000194
C  -1.568001 2.906822 0.000559
C  -1.568009 -2.906824 0.000223
C  3.195794 1.428656 0.000054
C  3.19579 -1.428671 -0.000341
C  4.400031 0.715705 -0.000088
C  4.400029 -0.715723 -0.000291
H  -1.033934 3.270376 -0.891812
H  -1.033724 3.26981 0.89303
H  -2.609649 3.257508 0.000744
H  -1.034039 -3.270184 -0.892284
H  -2.609658 -3.257508 0.000491
H  -1.033635 -3.270009 0.892558
H  3.169315 2.52255 0.000205
H  3.169308 -2.522565 -0.000486
H  5.353853 1.253857 -0.000041
H  5.35385 -1.253877 -0.000408
