program: Gaussian 09
title: 000278888
version: EM64L-G09RevD.01
frameworkgroup: C1[X(C20H12N2O2)]
method: RPBEPBE
basis: SDD
operation: Freq
keyword: #p
keyword: freq=noraman
keyword: PBEPBE/SDD
title: #p freq=noraman PBEPBE/SDD
converged: YES YES NO NO
title: Mulliken charges:
elementType: O O N N C C C C C C C C C C C C C C C C C C C C H H H H H H H H H H H H
charge: -0.158902 -0.158894 0.013984 0.013926 0.001079 0.001163 -0.062118 -0.062122 0.307470 0.307377 0.070635 0.070656 -0.369140 -0.369123 -0.365003 -0.364967 -0.249423 -0.249400 -0.233659 -0.233662 -0.227317 -0.227325 -0.236400 -0.236409 0.281828 0.281870 0.259557 0.259560 0.266002 0.265999 0.233917 0.233921 0.233321 0.233319 0.234138 0.234140
chargesum: 0.00000
title: Mulliken charges with hydrogens summed into heavy atoms:
elementType: O O N N C C C C C C C C C C C C C C C C C C C C
charge: -0.158902 -0.158894 0.013984 0.013926 0.001079 0.001163 -0.062118 -0.062122 0.307470 0.307377 0.070635 0.070656 -0.087312 -0.087253 -0.105445 -0.105407 0.016578 0.016599 0.000258 0.000259 0.006005 0.005994 -0.002262 -0.002269
polarizability: 3.57726848e+02 -1.00064477e-02 3.06837364e+02 1.18035115e-03 3.35332408e+01 1.31731958e+02
1716.lowfreq: -6.0835 -0.0009 -0.0007 -0.0004 4.4527 5.8894 31.3256 49.6998 52.2328
frequency: 31.3214 49.6675 52.2292 58.0933 78.1339 79.6689 92.3682 157.2635 165.9172 217.6542 219.8913 241.5965 249.2073 270.2078 303.2970 342.5133 401.7717 405.0503 406.4644 430.1695 439.8641 479.8034 484.0212 493.9228 561.1364 564.3240 600.2785 613.2146 613.3959 615.7483 624.9951 662.3967 663.9600 696.9377 698.9527 714.3562 751.2750 761.4241 782.6344 797.7737 823.8527 856.1451 857.3685 860.5386 898.0141 937.1756 939.2270 985.2767 986.4974 988.3011 988.8754 1001.1973 1003.0405 1003.0546 1009.7488 1017.5812 1030.8829 1035.6363 1077.5525 1085.7291 1093.8682 1164.9155 1175.2399 1175.3910 1192.8559 1194.2510 1201.3640 1242.9671 1264.8794 1320.4985 1320.9880 1326.9575 1347.7077 1365.6870 1376.3337 1382.2640 1397.9850 1420.4468 1437.2056 1443.7171 1481.4424 1487.2532 1487.7039 1551.3380 1580.2038 1580.8440 1581.8922 1606.7271 1610.0787 1616.9003 3130.4857 3130.6280 3140.8806 3141.1543 3141.2048 3153.1759 3153.6055 3163.5200 3163.6003 3165.8107 3172.7017 3172.8590
redmass: 9.4775 4.8343 3.7931 5.2984 4.2236 8.1355 6.2217 7.6459 5.9180 5.5010 6.5418 8.2899 8.2687 4.5130 5.4624 6.5406 2.8429 8.5757 2.8610 9.0160 5.6284 4.2782 8.7305 6.8065 9.3415 4.4518 6.7881 4.4173 6.4883 3.2012 5.4937 10.6140 6.0229 2.1200 1.7733 3.9693 2.7230 3.9420 2.5588 3.5316 8.5785 1.2468 1.2455 1.9882 6.5031 1.4052 1.4082 1.7228 1.3928 6.2040 3.2747 1.3051 1.3319 1.3313 4.6817 5.2165 2.3305 2.1669 1.9900 1.6401 1.7946 4.3306 1.0639 1.0561 1.1197 1.1320 2.0439 3.9971 6.5062 1.8758 1.3883 2.8445 1.7469 4.9065 6.1604 7.6176 5.9771 5.7299 2.4289 2.8048 5.3651 3.2161 2.6009 12.1910 9.3337 5.9040 6.3312 5.9204 5.9950 7.2457 1.0852 1.0853 1.0886 1.0869 1.0886 1.0933 1.0931 1.0964 1.0961 1.0999 1.1004 1.1004
irintensity: 0.0016 0.0888 0.1006 2.7485 0.1483 8.6756 0.5914 1.9703 0.4642 1.9348 0.9443 1.1743 0.0107 0.1434 3.4186 3.1851 0.0301 16.0014 0.6559 0.7948 4.5236 16.5047 0.5612 3.2348 4.6478 32.2925 0.0084 6.9257 0.0224 1.9371 7.7530 0.0340 7.0559 30.5168 78.4306 0.9312 9.9910 32.9252 46.0086 17.8170 3.6954 4.2544 3.2675 37.9555 14.7313 1.0945 4.4072 0.1254 4.1809 2.3015 5.0108 0.1943 0.6526 0.7820 1.9352 1.1213 3.1652 78.3974 51.1391 19.8591 65.8526 7.0856 0.1194 0.3682 15.2421 3.7794 39.5667 45.4927 6.0226 98.4085 8.3474 238.6613 2.8902 62.0040 1.3577 0.0131 11.1675 19.3780 49.0749 3.2653 130.4202 79.4668 6.5933 107.5740 163.0211 1.8677 14.8248 19.8001 2.9425 9.4401 0.4696 0.0028 8.0538 0.4545 4.4447 36.3949 7.7134 14.5991 12.5493 15.1100 19.6932 23.1133
temp: 298.150 k
press: 1.00000 atm
elementType: 8 8 7 7 6 6 6 6 6 6 6 6 6 6 6 6 6 6 6 6 6 6 6 6 1 1 1 1 1 1 1 1 1 1 1 1
symmnumber: 1
zpe: 690951.9 jmol-1
zpe.correction: 0.263170 hartree
zpe.thermalcorrener: 0.281593 hartree
zpe.thermalcorrenthalpy: 0.282537 hartree
zpe.thermalcorrgfe: 0.215386 hartree
zpe.sumelectzpe: -1027.645562 hartree
zpe.sumelectthermal: -1027.627138 hartree
zpe.sumelectthermalent: -1027.626194 hartree
zpe.sumelectthermalfe: -1027.693346 hartree
dipole: -3.4126 0.0004 0.0003
dipole: 3.4126
quadrupole: -112.9418 -141.6814 -138.2245
quadrupole: 0.0026 0.0013 -4.7639
quadrupole: 18.0074 -10.7322 -7.2753 0.0026 0.0013 -4.7639
hfenergy: -1027.9087313 hartree
pointgroup: C01 [X(C20H12N2O2)]
dipole: 1.3426152 -0.0001438 0.0000784 debye
polarizability: 357.7268469|-0.0150915|276.7675747|-0.0105665|-74.0652997|161.8017484 unknown
InChI: InChI=1S/C20H12N2O2/c23-15-11-12-16(24)20-19(15)21-17(13-7-3-1-4-8-13)18(22-20)14-9-5-2-6-10-14/h1-12H
charge 0 multiplicity 1
36 atoms
O  -3.470637 2.093195 -1.794827
O  -3.470288 -2.092996 1.794955
N  -0.981776 1.237517 -0.651516
N  -0.9817 -1.237326 0.651108
C  0.196617 0.691377 -0.232709
C  0.196623 -0.691308 0.231931
C  -2.14969 0.58646 -0.408395
C  -2.149621 -0.586175 0.408314
C  1.371549 1.598112 -0.228754
C  1.371479 -1.598072 0.22809
C  -3.431843 1.140704 -0.961185
C  -3.431644 -1.140274 0.961596
C  1.412331 2.687016 -1.143779
C  1.411867 -2.68715 1.142912
C  2.42239 1.451395 0.71921
C  2.422654 -1.451276 -0.719518
C  -4.684997 0.515773 -0.449323
C  -4.684902 -0.515551 0.449727
C  2.493832 3.590797 -1.128583
C  2.493268 -3.591059 1.127885
C  3.495763 2.364658 0.738431
C  3.495916 -2.364646 -0.73856
C  3.541161 3.432179 -0.189928
C  3.540912 -3.432371 0.189615
H  0.583661 2.80924 -1.847873
H  0.582944 -2.809445 1.846701
H  2.39264 0.637204 1.450096
H  2.393203 -0.636997 -1.450311
H  -5.616267 0.948479 -0.832694
H  -5.616108 -0.948329 0.833192
H  2.518661 4.420238 -1.84353
H  2.517733 -4.420663 1.842654
H  4.293869 2.247786 1.47946
H  4.294281 -2.247733 -1.479302
H  4.380114 4.136782 -0.176767
H  4.379806 -4.137045 0.176579
