program: Gaussian 09
title: 000278847
version: EM64L-G09RevD.01
frameworkgroup: C1[X(C13H12N4)]
method: RPBEPBE
basis: SDD
operation: Freq
keyword: #pfreq=noraman
keyword: PBEPBE/SDD
title: #p freq=noraman PBEPBE/SDD
converged: NO NO NO NO
title: Mulliken charges:
elementType: N N N N C C C C C C C C C C C C C H H H H H H H H H H H H
charge: 0.066541 0.078598 0.060550 0.061084 0.055181 0.026064 -0.214884 -0.207259 0.473998 -0.532238 0.094159 0.093697 -0.322931 -0.326352 -0.768005 -0.767842 -0.804313 0.273647 0.268750 0.239181 0.265360 0.229308 0.229393 0.229398 0.229215 0.265214 0.235016 0.234718 0.234751
chargesum: 0.00000
title: Mulliken charges with hydrogens summed into heavy atoms:
elementType: N N N N C C C C C C C C C C C C C
charge: 0.066541 0.078598 0.060550 0.061084 0.055181 0.026064 -0.214884 -0.207259 0.473998 -0.258590 0.094159 0.093697 -0.054181 -0.087171 -0.043944 -0.044015 -0.099828
polarizability: 3.56832826e+02 6.36668968e+00 1.53420876e+02 2.83697333e-02 3.58468108e-02 7.77530858e+01
1716.lowfreq: -0.0008 -0.0003 0.0002 2.6730 5.8332 10.7234 51.8565 66.4325 103.6860
frequency: 51.7397 66.3979 103.6528 119.9611 138.1803 167.1112 173.4282 198.4334 251.4885 279.4079 292.2377 331.2936 344.7292 368.0193 382.6023 412.7953 466.4058 484.8809 519.9276 523.9394 549.7034 574.9154 579.6585 611.7442 656.4720 678.1460 722.1911 744.0399 771.0424 787.3031 816.1316 839.0178 874.0264 908.3361 933.3983 988.0172 1004.5744 1010.0271 1010.2792 1016.6401 1050.0688 1053.9250 1135.2617 1149.1203 1169.5932 1191.2036 1216.0378 1232.7877 1277.9252 1309.0568 1316.9561 1352.7835 1386.3046 1388.8253 1398.6238 1399.7958 1425.1707 1428.5426 1437.0843 1457.1685 1466.5193 1466.9983 1471.4395 1472.4556 1478.0601 1492.5142 1528.2138 1568.1873 1632.1279 2972.3182 2978.0637 2979.2561 3048.0036 3052.3725 3053.5174 3089.2873 3119.0125 3120.0921 3127.3480 3152.4456 3166.4709
redmass: 3.7029 3.9412 1.0805 1.1699 2.6546 3.7928 2.1048 1.4645 3.8556 3.2029 2.6409 4.3056 5.3582 4.7652 3.4310 5.3231 5.5590 4.1249 8.8926 5.0989 5.0972 9.8003 3.3932 6.6375 3.5059 7.7303 6.6792 5.7972 4.0127 5.5169 3.6447 1.7272 3.7728 1.5085 2.6689 1.3218 1.7580 1.7590 1.8873 1.4082 1.5711 1.7239 1.7194 2.6974 3.3294 3.4137 7.8595 1.9509 7.1521 2.2492 5.1420 4.7212 1.7157 2.3974 1.2381 1.3515 3.1812 2.9896 1.3384 1.0482 2.3178 1.0459 1.0461 1.5846 1.5148 4.4656 5.3872 6.9476 6.4543 1.0379 1.0391 1.0385 1.0970 1.0962 1.0963 1.0986 1.0982 1.0980 1.0890 1.0927 1.0964
irintensity: 1.0277 3.8899 0.0895 0.0209 0.6080 4.6923 0.6521 0.3620 0.4916 0.8134 0.8050 0.0006 0.0895 1.6092 1.0420 1.2278 0.2549 0.0001 30.4289 3.4673 1.0549 1.2433 5.7752 2.7077 0.8686 6.6894 8.3398 5.5776 0.4045 2.0470 7.6585 39.3560 3.4423 4.6069 0.3637 1.1561 18.5993 43.7886 3.6819 7.4619 13.3252 0.0010 4.4404 3.3545 20.5376 1.3292 0.0072 1.3465 1.9494 14.1936 31.7162 118.1766 12.4678 3.9398 18.9703 58.7329 8.2654 30.8227 13.2858 0.2285 16.6815 14.6744 40.8615 21.4630 14.8073 20.0869 16.4865 4.9083 34.8523 28.0093 5.1701 26.5715 16.9970 12.3576 17.5040 15.4104 13.1209 2.5524 13.4506 7.6430 12.1764
temp: 298.150 k
press: 1.00000 atm
elementType: 7 7 7 7 6 6 6 6 6 6 6 6 6 6 6 6 6 1 1 1 1 1 1 1 1 1 1 1 1
symmnumber: 1
zpe: 585950.3 jmol-1
zpe.correction: 0.223177 hartree
zpe.thermalcorrener: 0.237595 hartree
zpe.thermalcorrenthalpy: 0.238539 hartree
zpe.thermalcorrgfe: 0.182154 hartree
zpe.sumelectzpe: -720.404803 hartree
zpe.sumelectthermal: -720.390385 hartree
zpe.sumelectthermalent: -720.389441 hartree
zpe.sumelectthermalfe: -720.445825 hartree
dipole: 0.4372 -0.1560 0.0022
dipole: 0.4642
quadrupole: -58.6433 -108.7004 -99.9095
quadrupole: 2.2438 0.0018 -0.0046
quadrupole: 30.4411 -19.6160 -10.8251 2.2438 0.0018 -0.0046
hfenergy: -720.6279793 hartree
pointgroup: C01 [X(C13H12N4)]
dipole: 0.1713879 0.0630556 0.0003983 debye
polarizability: 356.9365551|-4.3556191|153.2622695|-0.7499049|2.0090887|77.8079638 unknown
InChI: InChI=1S/C13H12N4/c1-7-4-5-10-11(6-7)17-13-12(16-10)14-8(2)9(3)15-13/h4-6H,1-3H3
charge 0 multiplicity 1
29 atoms
N  0.32956 1.349192 0.0338
N  0.158099 -1.552702 -0.04421
N  -2.021448 1.479085 0.040602
N  -2.192406 -1.405749 -0.033454
C  1.454564 0.561286 0.010041
C  1.364761 -0.900576 -0.029723
C  -0.86563 0.695956 0.018603
C  -0.953276 -0.76409 -0.02014
C  3.914814 0.424181 0.0002
C  2.74624 1.186471 0.024027
C  -3.199716 0.841735 0.025952
C  -3.287557 -0.634326 -0.010833
C  2.579485 -1.667227 -0.053758
C  3.809949 -1.021568 -0.039224
C  -4.453249 1.682211 0.046903
C  -4.631653 -1.320574 -0.023962
C  5.289956 1.060951 0.014294
H  2.771791 2.280663 0.053697
H  2.48769 -2.757254 -0.083139
H  4.736408 -1.609102 -0.057474
H  -4.17563 2.746799 0.071231
H  -5.08028 1.494156 -0.845676
H  -5.078963 1.453427 0.93089
H  -5.226187 -1.063368 0.87373
H  -5.232565 -1.016866 -0.902596
H  -4.481937 -2.410457 -0.052924
H  5.230923 2.162004 0.04536
H  5.874187 0.725208 0.89288
H  5.86947 0.775234 -0.884897
