program: Gaussian 09
title: 000278840
version: EM64L-G09RevD.01
frameworkgroup: C1[X(C11H7ClF3N)]
method: RPBEPBE
basis: SDD
operation: Freq
keyword: #p
keyword: freq=noraman
keyword: PBEPBE/SDD
title: #p freq=noraman PBEPBE/SDD
converged: NO NO NO NO
title: Mulliken charges:
elementType: Cl F F F N C C C C C C C C C C C H H H H H H H
charge: -0.021310 -0.166569 -0.166541 -0.132110 0.008053 0.490175 -0.114024 -0.538647 0.451192 -0.190094 0.027970 -0.308798 -0.332192 -0.266660 -0.805992 0.293993 0.261295 0.274804 0.282924 0.243840 0.232971 0.237843 0.237875
chargesum: 0.00000
title: Mulliken charges with hydrogens summed into heavy atoms:
elementType: Cl F F F N C C C C C C C C C C C
charge: -0.021310 -0.166569 -0.166541 -0.132110 0.008053 0.490175 -0.114024 -0.277352 0.451192 -0.190094 0.027970 -0.033994 -0.088352 0.016264 -0.097303 0.293993
polarizability: 2.05551196e+02 1.49383379e+01 1.56451699e+02 2.81049998e-02 -1.97569879e-02 6.35632790e+01
1716.lowfreq: -14.4776 -4.3655 0.0006 0.0011 0.0012 7.8336 7.9120 58.6225 100.2463
frequency: -13.8796 58.6197 100.2193 110.2117 123.7325 157.7416 168.0833 198.0362 255.0869 267.2921 283.6219 325.4654 380.4704 394.3603 418.9271 455.2050 474.3649 496.9086 526.0813 541.7377 552.9316 614.0328 629.6235 687.3786 689.0761 775.5249 785.3998 811.5601 841.2092 875.2586 895.8407 901.7609 965.0258 981.5398 990.1518 1012.3811 1047.5940 1050.4015 1069.3165 1140.3537 1157.8396 1218.1460 1256.9407 1291.5583 1296.8999 1338.6686 1388.0320 1401.5628 1405.2113 1449.4154 1469.1558 1481.8767 1495.7339 1545.7482 1577.9239 1632.0540 2979.1354 3056.4911 3093.5315 3133.4448 3148.8090 3172.0338 3182.7579
redmass: 16.1703 5.2323 1.0641 7.0870 10.5418 4.0208 8.1518 5.2119 8.2542 6.4934 10.0346 5.1344 6.4174 8.5026 3.6833 7.0692 7.6819 6.6154 7.0499 3.5663 7.6755 5.4180 12.6319 6.7361 4.4899 7.5109 3.3048 7.9258 1.4393 1.4859 5.3534 1.4815 3.2259 10.8641 1.3616 1.5628 8.2345 1.5753 4.9063 1.6999 1.7197 1.9545 1.7446 2.8136 6.8207 3.2463 5.0301 1.2757 4.1128 2.1863 1.0453 1.5411 3.6434 6.7689 8.6767 6.4751 1.0378 1.0972 1.0988 1.0897 1.0916 1.0962 1.0941
irintensity: 0.0589 0.1103 0.8130 0.6756 0.1946 2.5034 0.8376 2.1755 3.9887 0.1027 3.3117 0.3650 1.4987 4.5411 6.5704 0.8076 2.2787 10.1944 0.9399 2.9336 1.9936 5.0485 24.2047 13.1485 0.1831 30.6988 2.0819 35.4151 33.9595 31.1181 32.1236 5.4977 20.6350 231.4866 12.3192 13.2457 198.6472 14.6070 99.7742 41.0804 58.4990 63.6604 3.1802 5.8459 158.0543 33.8234 11.3898 18.6448 25.1087 41.3580 15.0036 8.7077 65.9462 27.3328 18.8363 15.9284 21.6095 15.0598 14.5291 11.2415 4.1706 5.3284 1.8192
temp: 298.150 k
press: 1.00000 atm
elementType: 17 9 9 9 7 6 6 6 6 6 6 6 6 6 6 6 1 1 1 1 1 1 1
symmnumber: 1
zpe: 402097.8 jmol-1
zpe.correction: 0.153151 hartree
zpe.thermalcorrener: 0.166184 hartree
zpe.thermalcorrenthalpy: 0.167128 hartree
zpe.thermalcorrgfe: 0.113138 hartree
zpe.sumelectzpe: -1236.591967 hartree
zpe.sumelectthermal: -1236.578934 hartree
zpe.sumelectthermalent: -1236.577990 hartree
zpe.sumelectthermalfe: -1236.631980 hartree
dipole: -5.9150 0.2590 -0.0001
dipole: 5.9206
quadrupole: -93.3689 -95.4080 -101.0694
quadrupole: 8.7933 0.0092 -0.0014
quadrupole: 3.2466 1.2074 -4.4540 8.7933 0.0092 -0.0014
hfenergy: -1236.7451176 hartree
pointgroup: C01[X(C11H7Cl1F3N1)]
dipole: -2.3189724 -0.2195637 -0.0067872 debye
dipolederiv: -0.128149 -0.1987432 -0.0092824 -0.0927115 -0.7680071 -0.0341802 -0.0042082 -0.0341491 -0.0455527 -0.7716854 0.0753799 -0.2251969 0.1031275 -0.3670641 0.1845681 -0.2409873 0.1603104 -0.6180572 -0.7712227 0.0519571 0.232432 0.0779939 -0.3351882 -0.1563827 0.2515109 -0.1320184 -0.6514269 -0.5139539 -0.2037979 -0.0097517 -0.2333425 -0.7223915 -0.0227705 -0.0110138 -0.0227748 -0.2685972 -0.1198096 0.0250746 0.0008808 -0.0609957 -0.3995562 -0.0095295 -0.0032878 -0.009643 -0.1949271 0.1885431 -0.1527572 -0.0074737 0.2277771 -0.5277264 -0.030082 0.0102057 -0.029199 0.1006748 0.0352502 0.0840247 0.0041944 -0.3788484 0.1782773 0.0062785 -0.01742 0.0054239 0.0585219 -0.3659149 0.0387631 0.0022012 0.1982419 0.0140282 0.0079185 0.0097221 0.0082497 -0.1654471 0.6231661 0.0308103 0.0000535 0.0603311 -0.0048102 -0.0001338 0.0013322 0.0000102 -0.0046162 0.3037224 0.3517364 0.0160391 0.0711995 1.2697491 0.0627997 0.0028957 0.0624612 -0.0544739 -0.1842454 -0.0293444 -0.0010292 0.1367313 0.337352 0.0198524 0.0062006 0.0201358 -0.0892636 -0.0510913 0.04468 0.0019676 0.0230001 0.0915732 0.0102101 0.0009736 0.0101619 -0.1274164 -0.1691755 -0.1085628 -0.0050009 -0.2359393 0.1219498 0.0135986 -0.0108744 0.0133239 -0.1596152 -0.3273196 -0.2537125 -0.011671 -0.138681 -0.3731386 -0.0153391 -0.0062396 -0.0152737 -0.0429364 -0.2538992 0.0118815 0.0012186 0.0920345 0.0523571 -0.0002197 0.0047614 -0.0000057 0.0524379 2.2444613 0.1150099 0.0041401 0.1900464 1.3573985 -0.0082013 0.0073123 -0.0080733 1.5256395 0.05806 -0.0293757 -0.0011601 -0.0795147 -0.0040538 -0.0072459 -0.0034182 -0.0073763 0.1552654 0.0760059 -0.0627868 -0.0027793 -0.0193035 -0.0105902 -0.0078519 -0.0008315 -0.0077869 0.1583534 0.0870278 0.0459299 0.0023572 0.0513041 0.0747222 -0.0045525 0.0025031 -0.0046406 0.169021 -0.0039993 0.1114117 0.0054928 0.0965184 -0.0126485 -0.0077055 0.0048811 -0.0077902 0.148593 0.0575573 0.0116284 0.0006693 -0.1141637 -0.1092356 -0.0098518 -0.0050725 -0.0101726 0.1116724 -0.0062573 0.0178904 0.05131 0.0074075 0.0762512 -0.0910664 0.1090503 -0.0697307 -0.0370826 -0.0070708 0.0229024 -0.0496115 0.0177871 0.0607519 0.0998871 -0.1079954 0.0785577 -0.0207668 unknown
polarizability: 206.9363419|-12.3521251|154.8626159|-0.8306202|4.3105585|63.7672162 unknown
InChI: InChI=1S/C11H7ClF3N/c1-6-2-3-9-7(4-6)8(12)5-10(16-9)11(13,14)15/h2-5H,1H3
charge 0 multiplicity 1
23 atoms
Cl -0.626908 -3.344549 -0.16225
F  3.770015 -0.255165 1.110353
F  3.767336 -0.141152 -1.151952
F  3.420104 1.734831 0.076973
N  0.781785 1.089349 0.04471
C  -1.087911 -0.566593 -0.029847
C  -0.571133 0.791358 0.032663
C  -2.500814 -0.778486 -0.036811
C  -3.39608 0.297694 0.015083
C  -0.104047 -1.609269 -0.080679
C  1.635899 0.058822 -0.004821
C  -1.499667 1.878373 0.084836
C  -2.871551 1.636232 0.076101
C  1.256108 -1.319404 -0.069511
C  -4.896231 0.082198 0.008622
C  3.121074 0.372822 0.008711
H  -2.87935 -1.804902 -0.083685
H  -1.086769 2.8902 0.13133
H  2.011758 -2.107386 -0.10823
H  -3.573857 2.47736 0.116701
H  -5.156226 -0.988402 -0.039643
H  -5.361335 0.505334 0.918988
H  -5.3655 0.586534 -0.857141
