program: Gaussian 09
title: 000278835
version: EM64L-G09RevD.01
frameworkgroup: C1[X(C10H8F3N3)]
method: RPBEPBE
basis: SDD
operation: Freq
keyword: #p
keyword: freq=noraman
keyword: PBEPBE/SDD
title: #p freq=noraman PBEPBE/SDD
converged: YES YES NO NO
title: Mulliken charges:
elementType: F F F N N N C C C C C C C C C C H H H H H H H H
charge: -0.173899 -0.173835 -0.131660 -0.027285 -0.411015 -0.534017 0.287734 0.377581 -0.074873 0.041973 -0.461222 -0.340999 -0.317983 -0.267926 0.282798 -0.222451 0.260809 0.201802 0.273197 0.233691 0.238083 0.326211 0.306672 0.306615
chargesum: 0.00000
title: Mulliken charges with hydrogens summed into heavy atoms:
elementType: F F F N N N C C C C C C C C C C
charge: -0.173899 -0.173835 -0.131660 -0.027285 -0.084803 0.079270 0.287734 0.377581 -0.074873 0.041973 -0.200413 -0.139197 -0.044787 -0.034235 0.282798 0.015632
polarizability: 1.80539299e+02 1.88170459e+01 1.63161012e+02 3.47669137e-02 -8.39844294e-04 6.24488050e+01
1716.lowfreq: -19.9015 -6.9910 -5.0302 -0.0004 -0.0003 0.0002 3.8695 68.7175 86.7058
frequency: -19.7898 68.7167 86.7012 123.4432 140.6291 174.9188 193.3602 242.3447 269.7319 299.4621 300.0913 343.0938 370.9905 425.9229 455.3320 463.3410 493.3638 524.9695 528.6302 549.2215 567.0183 577.4141 630.1788 635.7011 649.7604 694.4696 766.3459 766.6463 785.0538 839.3900 858.0689 870.9113 898.3018 957.6322 973.3002 998.4665 1020.4562 1037.5775 1051.1118 1093.2567 1138.8967 1174.9705 1197.9421 1239.4908 1251.5318 1259.1086 1283.2868 1346.9909 1389.4351 1398.9994 1434.8612 1449.4585 1470.4879 1532.8810 1558.0049 1592.3268 1623.5118 1664.1064 3118.5752 3141.8911 3159.2428 3175.1282 3175.4686 3422.4216 3552.7565 3583.5185
redmass: 13.9192 5.0532 4.9733 8.1218 3.4126 4.0260 5.1104 3.7946 9.8047 8.7071 1.4208 6.7921 6.3285 2.9620 7.5867 8.1331 5.2734 6.5913 1.2927 2.7593 4.0348 1.9196 6.7456 3.3739 11.7615 5.5317 5.7208 1.5163 2.5164 6.6420 1.5104 1.7300 8.3707 1.3980 11.2740 1.3362 3.9471 3.0983 5.5319 3.3383 1.6893 1.2468 2.2343 2.5054 1.1746 2.0995 3.1997 2.5077 6.1720 4.0131 2.6332 2.3823 2.4142 3.8132 5.2554 6.0091 6.2243 1.0764 1.0872 1.0889 1.0945 1.0966 1.0943 1.0407 1.1039 1.0777
irintensity: 0.2960 0.0001 0.7028 0.8986 2.2042 2.9091 0.5703 0.1277 6.9915 0.1969 1.0953 0.4037 2.2481 0.2212 2.1429 0.9758 17.8874 16.3931 111.2788 50.9339 86.7612 186.3090 22.1621 0.1370 1.4707 1.9673 2.8795 91.5633 18.4610 18.4424 21.0541 3.5738 65.9168 0.3791 240.8401 1.0316 8.8717 29.8729 168.4058 45.6313 76.2308 11.7573 49.6698 96.1199 0.0098 23.4834 30.5040 8.2488 16.9701 64.5717 41.4306 36.1082 7.8535 116.8776 78.7531 129.3555 4.8054 19.1068 9.4743 11.4060 18.0347 14.0816 3.1852 0.7439 3.2053 52.0566
temp: 298.150 k
press: 1.00000 atm
elementType: 9 9 9 7 7 7 6 6 6 6 6 6 6 6 6 6 1 1 1 1 1 1 1 1
symmnumber: 1
zpe: 442980.9 jmol-1
zpe.correction: 0.168723 hartree
zpe.thermalcorrener: 0.181571 hartree
zpe.thermalcorrenthalpy: 0.182515 hartree
zpe.thermalcorrgfe: 0.129594 hartree
zpe.sumelectzpe: -848.486012 hartree
zpe.sumelectthermal: -848.473164 hartree
zpe.sumelectthermalent: -848.472220 hartree
zpe.sumelectthermalfe: -848.525141 hartree
dipole: -5.0602 3.7114 0.0040
dipole: 6.2754
quadrupole: -88.2966 -83.2304 -94.4527
quadrupole: 7.9982 0.0013 0.0156
quadrupole: 0.3633 5.4295 -5.7928 7.9982 0.0013 0.0156
hfenergy: -848.6547349 hartree
pointgroup: C01 [X(C10H8F3N3)]
dipole: 1.9616831 1.4868558 -0.1913929 debye
dipolederiv: -0.7268236 0.0656654 0.2290016 0.1064784 -0.389033 -0.2005326 0.2296 -0.1709332 -0.6193036 -0.7562748 0.031598 -0.232747 0.0734163 -0.3300821 0.1434545 -0.2416114 0.1163591 -0.650314 -0.5024725 -0.2147291 0.026915 -0.2195363 -0.7120498 0.0485973 0.0270254 0.0483484 -0.2715248 -0.4960471 0.2036687 -0.0093538 0.0360712 -0.5917765 0.0313989 0.0055166 0.0265704 -0.2221093 -0.0145058 -0.5807472 0.0383963 -0.0997343 -0.9527274 0.0480561 -0.0036647 0.0617818 -0.442146 -0.1989625 -0.502407 0.0493072 -0.2028127 -0.462935 0.045081 0.0231635 0.0541032 -0.0144469 0.0241245 0.1104819 -0.0094529 -0.0246585 -0.4052631 0.0384867 0.0019111 0.0344937 0.0241182 0.2109492 0.7117876 -0.0642878 0.1493452 1.2880297 -0.1047662 -0.015234 -0.1214841 0.1458765 0.3811508 -0.1008655 -0.0005671 -0.1344503 0.0831217 0.0029236 0.0022474 0.0020282 0.0689353 -0.0409618 -0.0042913 -0.000943 -0.1345856 0.6688645 -0.0615435 0.0109414 -0.0655168 -0.0745437 -0.2883286 -0.6068157 0.0560782 0.0463325 -0.492125 0.024283 -0.0009232 0.0438017 -0.1999019 -0.0712542 -0.0112799 -0.0019239 0.1116119 0.0222513 -0.0195728 -0.0125107 -0.0161626 -0.1615793 -0.1221299 0.1095542 -0.0103035 0.0728128 0.1083338 -0.0242032 -0.0068834 -0.0252946 -0.1402646 0.0960121 0.1157762 -0.0174525 0.0364037 -0.0682575 -0.0079197 -0.0103637 -0.010334 -0.1449054 2.1239248 0.1411194 -0.0305424 0.1648472 1.3843032 0.0059981 -0.0317913 0.0066808 1.5097461 0.0053994 -0.1034977 0.0042752 -0.0975128 0.1224905 -0.0208276 0.0037097 -0.020621 -0.148779 0.0479635 0.0728504 -0.002714 0.0899904 0.0356961 0.0097889 -0.0041263 0.0102752 0.175879 0.0492548 -0.036319 0.0063535 -0.0987207 -0.1105987 0.0260914 0.0118717 0.0242156 0.1514264 0.0808374 -0.073317 0.0088353 -0.0187607 -0.0114163 0.0155726 0.0040924 0.0171877 0.1583732 -0.1175602 -0.0205271 0.0102194 -0.0345914 0.0839735 0.0077763 0.011391 0.0073684 0.1600796 0.0024893 0.1078215 -0.0046064 0.1070955 -0.0345943 0.0137885 -0.004565 0.0137796 0.1595317 0.0961302 0.1205125 -0.0038357 0.0592173 0.1812829 0.0106667 0.0014949 0.0088764 0.3218747 0.1128858 0.2423566 0.0792447 0.0129297 0.3052149 0.0759228 0.0506829 0.0439527 0.0887963 0.104199 0.2216042 -0.1198967 -0.0011887 0.2772965 -0.1085205 -0.0519744 -0.089477 0.1251815 unknown
polarizability: 181.144405|-18.7031837|161.7859862|-1.9306587|-8.1330011|63.2187248 unknown
InChI: InChI=1S/C10H8F3N3/c11-10(12,13)9-5-8(16-14)6-3-1-2-4-7(6)15-9/h1-5,16H,14H2
charge 0 multiplicity 1
24 atoms
F  -3.344122 0.14998 1.236592
F  -3.413486 -0.060679 -1.018443
F  -3.055208 -1.884084 0.279035
N  -0.413332 -1.291724 0.138821
N  0.946459 2.746768 -0.255315
N  0.096587 3.863461 -0.328121
C  1.470778 0.340608 -0.060922
C  0.511124 1.43348 -0.127952
C  0.945576 -1.002465 0.072494
C  -1.246278 -0.241154 0.071075
C  -0.860909 1.120773 -0.060461
C  2.888287 0.520897 -0.119555
C  1.853274 -2.106036 0.141357
C  3.753941 -0.576253 -0.050136
C  -2.733183 -0.536485 0.143438
C  3.233431 -1.899723 0.081222
H  -1.621649 1.902779 -0.107363
H  3.326768 1.520793 -0.220273
H  1.418268 -3.104745 0.241947
H  4.837018 -0.420549 -0.09649
H  3.920624 -2.750653 0.134578
H  1.94023 2.961655 -0.303388
H  -0.423476 4.049312 0.536746
H  -0.472322 3.900145 -1.181383
