program: Gaussian 09
title: 000278830
version: EM64L-G09RevD.01
frameworkgroup: C1[X(C13H9N3O2)]
method: RPBEPBE
basis: SDD
operation: Freq
keyword: #p
keyword: freq=noraman
keyword: PBEPBE/SDD
title: #p freq=noraman PBEPBE/SDD
converged: NO YES NO NO
title: Mulliken charges:
elementType: O O N N N C C C C C C C C C C C C C H H H H H H H H H
charge: -0.205149 -0.192566 -0.464867 -0.064487 0.020785 0.082872 0.278274 0.405195 0.016697 -0.495027 -0.366491 -0.372490 -0.336383 0.376696 -0.210033 -0.228154 -0.201790 -0.375468 0.313695 0.331660 0.236295 0.207534 0.254989 0.227887 0.239585 0.230070 0.290672
chargesum: 0.00000
title: Mulliken charges with hydrogens summed into heavy atoms:
elementType: O O N N N C C C C C C C C C C C C C
charge: -0.205149 -0.192566 -0.151171 -0.064487 0.020785 0.082872 0.278274 0.405195 0.016697 -0.163367 -0.130196 -0.164956 -0.081394 0.376696 0.017853 0.001916 0.037794 -0.084796
polarizability: 3.28738400e+02 1.93714638e+01 1.82090924e+02 -1.99900238e-01 2.16775610e-01 6.30812439e+01
1716.lowfreq: -0.0005 0.0004 0.0004 4.2254 6.6940 11.8717 29.6498 46.3371 71.9624
frequency: 29.4132 46.3272 71.9477 74.0022 160.0900 188.2237 198.5844 252.5267 266.2266 317.7350 334.6160 387.8645 425.5582 433.5349 493.7461 520.7971 545.7510 557.0730 574.5435 592.8825 613.8090 646.9330 672.0372 693.4581 697.2723 728.0822 757.3492 769.3021 780.6195 814.4660 834.3259 859.7821 883.8947 923.4186 938.9736 941.2583 976.9046 981.6549 986.8816 995.4036 1005.3481 1076.7190 1090.4893 1093.2423 1114.8418 1161.4032 1181.3466 1215.6453 1220.0380 1242.1633 1261.8119 1287.9343 1308.7517 1336.3824 1377.2332 1394.9518 1413.6460 1427.3806 1443.2004 1458.8546 1479.6226 1536.5487 1583.9607 1591.8819 1619.6999 1632.7370 3129.3454 3133.2251 3145.2731 3160.5220 3160.8275 3174.7533 3184.0024 3190.7006 3602.9337
redmass: 5.0079 11.2034 6.0699 7.3116 5.5329 4.5411 7.6144 4.2803 8.3687 5.0774 5.3730 8.2778 3.1130 3.1678 7.4036 5.4084 5.1865 7.6729 2.5055 1.4068 6.6085 7.3235 4.7554 2.1241 9.2504 6.1608 1.4554 3.2494 6.8535 1.6373 6.1180 1.5002 6.3135 1.4474 6.8638 1.3796 1.4554 1.3102 6.1497 1.3556 2.0927 1.6867 1.5964 4.0608 1.6098 1.1405 1.1541 7.2459 2.7200 1.7043 2.7287 1.4483 2.8875 2.6448 10.9761 7.7786 3.1510 2.8757 3.2672 3.0553 3.2126 5.2364 6.5992 6.9004 6.9780 7.3191 1.0886 1.0858 1.0907 1.0958 1.0933 1.0991 1.0925 1.0962 1.0808
irintensity: 0.9138 0.0003 0.8190 0.1397 3.0035 0.0863 2.7003 6.5048 0.7685 0.0734 0.9290 2.6075 0.4359 11.0897 5.0695 4.4767 2.7070 4.1454 13.0134 54.1738 3.3852 2.7393 3.5032 59.6684 30.1761 3.2772 117.8548 11.9614 13.4920 36.5013 6.2317 0.0230 1.4121 0.0038 0.1559 4.0020 21.5692 0.0493 1.3653 0.4398 6.9048 26.7096 19.3789 7.0474 5.9430 2.1838 22.5066 233.6753 1.7012 50.9299 16.1343 5.0205 17.4657 63.0324 108.7632 5.1579 0.8048 14.8934 26.4536 58.6414 3.9827 2.7761 3.6607 6.1120 34.9474 0.0968 17.0233 0.0595 10.3988 21.5697 17.1354 21.6234 8.8948 6.6330 30.7799
temp: 298.150 k
press: 1.00000 atm
elementType: 8 8 7 7 7 6 6 6 6 6 6 6 6 6 6 6 6 6 1 1 1 1 1 1 1 1 1
symmnumber: 1
zpe: 516814.8 jmol-1
zpe.correction: 0.196844 hartree
zpe.thermalcorrener: 0.210404 hartree
zpe.thermalcorrenthalpy: 0.211348 hartree
zpe.thermalcorrgfe: 0.154977 hartree
zpe.sumelectzpe: -814.191423 hartree
zpe.sumelectthermal: -814.177863 hartree
zpe.sumelectthermalent: -814.176919 hartree
zpe.sumelectthermalfe: -814.233290 hartree
dipole: -4.4114 6.7105 0.0161
dipole: 8.0306
quadrupole: -109.2275 -92.9408 -107.4852
quadrupole: 11.6586 -0.1665 0.1023
quadrupole: -6.0097 10.2771 -4.2674 11.6586 -0.1665 0.1023
hfenergy: -814.3882671 hartree
pointgroup: C01 [X(C13H9N3O2)]
dipole: -1.6996596 2.6543408 -0.2191742 debye
polarizability: 329.0722739|17.7935349|181.1306074|5.2985401|-7.4521255|63.707687 unknown
InChI: InChI=1S/C13H9N3O2/c17-16(18)10-5-3-4-9(8-10)13-14-11-6-1-2-7-12(11)15-13/h1-8,14H
charge 0 multiplicity 1
27 atoms
O  5.353805 -0.94152 0.228123
O  3.626074 -2.427606 0.293791
N  -1.628791 1.324531 -0.099563
N  -1.107108 -0.892975 0.042079
N  4.094814 -1.229799 0.217033
C  -0.606671 0.360175 -0.023046
C  -2.856199 0.648525 -0.088893
C  0.826042 0.681212 -0.009597
C  -2.504999 -0.74449 0.00015
C  1.75253 -0.390111 0.092845
C  -4.193995 1.091326 -0.141222
C  1.319095 2.012738 -0.093926
C  -3.521544 -1.728431 0.035734
C  3.127051 -0.102052 0.108422
C  -5.190643 0.092914 -0.103948
C  -4.860331 -1.293627 -0.01714
C  2.707014 2.272705 -0.075844
C  3.632629 1.215521 0.02601
H  -1.506374 2.333266 -0.156003
H  1.387081 -1.418282 0.157871
H  -4.458743 2.151754 -0.207829
H  0.630343 2.86177 -0.177036
H  -3.260345 -2.788523 0.103684
H  -6.245055 0.387757 -0.14213
H  3.067288 3.304074 -0.142237
H  -5.669648 -2.031019 0.00916
H  4.712083 1.383663 0.042412
