program: Gaussian 09
title: 000278831
version: EM64L-G09RevD.01
frameworkgroup: C1[X(C13H10ClN3)]
method: RPBEPBE
basis: SDD
operation: Freq
keyword: #p
keyword: freq=noraman
keyword: PBEPBE/SDD
title: #p freq=noraman PBEPBE/SDD
converged: NO YES NO NO
title: Mulliken charges:
elementType: Cl N N N C C C C C C C C C C C C C H H H H H H H H H H
charge: -0.096200 -0.439706 -0.093246 -0.706665 0.079860 0.264741 0.014066 0.519973 -0.578545 -0.367212 -0.359985 -0.343775 0.546254 -0.214295 -0.230864 -0.190077 -0.439077 0.314833 0.287560 0.236470 0.246006 0.223702 0.224329 0.248203 0.228154 0.308782 0.316713
chargesum: 0.00000
title: Mulliken charges with hydrogens summed into heavy atoms:
elementType: Cl N N N C C C C C C C C C C C C C
charge: -0.096200 -0.124873 -0.093246 -0.081171 0.079860 0.264741 0.014066 0.519973 -0.290985 -0.130742 -0.359985 -0.097769 0.546254 0.009407 -0.006535 0.058126 -0.210923
polarizability: 3.12957790e+02 -8.49948642e+00 1.91411883e+02 1.60284851e-02 1.97574899e-01 6.50498670e+01
1716.lowfreq: -5.2394 0.0015 0.0016 0.0026 4.6040 4.7423 31.1607 65.0043 102.1156
frequency: 31.0505 65.0024 102.1151 102.7627 180.3005 212.3785 242.3363 253.6280 298.4555 321.8634 325.1775 368.2644 378.1299 404.2901 426.3373 430.8443 463.4455 530.2974 564.8031 576.3982 589.5483 615.9710 626.7667 671.2187 674.3404 691.0013 736.9192 756.5185 769.5276 786.2359 806.3054 858.4496 870.5777 887.0849 918.5544 936.0783 937.4390 951.9581 976.3060 999.1221 1006.1946 1037.7670 1107.3887 1116.8170 1144.2766 1160.6514 1224.0631 1229.0342 1248.6010 1271.4838 1297.9178 1330.4465 1339.4573 1381.3100 1412.8499 1421.8403 1437.0825 1468.3302 1478.5248 1522.2306 1581.0717 1592.7261 1620.2114 1630.8315 1645.6101 3129.3643 3135.2755 3142.0461 3145.3764 3156.5918 3169.3740 3169.9966 3541.4401 3564.8995 3705.0806
redmass: 5.2905 5.0419 5.8712 5.8509 5.0778 10.5752 6.7513 4.6689 5.2202 4.9103 5.2217 10.3777 1.1197 1.1470 3.7401 2.8927 3.1513 4.9428 7.6154 3.7281 4.5053 6.6437 6.9194 6.9224 1.1364 3.5043 3.8793 1.4578 3.5486 5.5310 1.4902 1.5107 5.3183 6.1884 1.6342 1.3365 1.3799 4.5825 1.3034 4.8498 2.4256 1.4937 2.0153 1.6796 1.2824 1.1223 2.8108 1.4849 1.5328 2.8084 2.5549 2.4679 3.2007 6.3998 2.9771 3.8710 3.6469 4.0525 3.3190 4.4039 6.9704 7.0804 4.8733 7.0807 1.2478 1.0853 1.0894 1.0901 1.0915 1.0958 1.0958 1.0995 1.0820 1.0451 1.1041
irintensity: 4.6817 0.8180 3.6615 2.4127 0.3064 0.0521 0.0932 4.6349 2.3768 2.0034 0.0431 7.1345 132.2813 192.1497 3.0625 5.8673 11.8208 14.6227 4.0866 0.0581 4.5443 1.6466 20.4778 0.2129 68.8683 3.0120 4.1837 124.4401 8.7959 0.3008 47.4008 0.0000 5.3203 2.0547 31.7000 2.8293 4.5976 2.4392 0.0241 19.6412 11.8613 1.9614 1.4822 13.3392 29.0920 1.0733 1.2836 43.3203 13.7506 16.6206 16.8740 8.4889 42.8040 34.5646 3.8674 30.9256 27.0891 169.0458 8.6583 23.2862 16.0982 5.3642 111.5580 5.2126 253.1163 0.4944 12.1681 9.5103 8.2779 25.7459 11.8526 27.0030 125.6697 88.1342 23.2812
temp: 298.150 k
press: 1.00000 atm
elementType: 17 7 7 7 6 6 6 6 6 6 6 6 6 6 6 6 6 1 1 1 1 1 1 1 1 1 1
symmnumber: 1
zpe: 531763.8 jmol-1
zpe.correction: 0.202538 hartree
zpe.thermalcorrener: 0.216193 hartree
zpe.thermalcorrenthalpy: 0.217137 hartree
zpe.thermalcorrgfe: 0.161545 hartree
zpe.sumelectzpe: -1124.558684 hartree
zpe.sumelectthermal: -1124.545030 hartree
zpe.sumelectthermalent: -1124.544085 hartree
zpe.sumelectthermalfe: -1124.599677 hartree
dipole: 2.6924 -0.6861 0.0746
dipole: 2.7795
quadrupole: -77.9122 -92.0117 -113.0288
quadrupole: -13.0332 0.1345 -0.0639
quadrupole: 16.4054 2.3058 -18.7112 -13.0332 0.1345 -0.0639
hfenergy: -1124.7612223 hartree
pointgroup: C01[X(C13H10Cl1N3)]
dipole: 1.0727389 0.0968818 0.1888192 debye
polarizability: 313.4748897|4.0812321|73.0418444|0.2869727|30.5663387|182.9028065 unknown
InChI: InChI=1S/C13H10ClN3/c14-10-6-5-8(15)7-9(10)13-16-11-3-1-2-4-12(11)17-13/h1-7,16H,15H2
charge 0 multiplicity 1
27 atoms
Cl 1.326973 -0.511583 -3.152243
N  -1.025369 -0.03179 -1.228713
N  -0.710519 0.524969 0.960461
N  4.222459 0.88797 1.992422
C  -0.094014 0.237585 -0.213163
C  -2.305571 0.084134 -0.681517
C  -2.086458 0.43915 0.696005
C  1.373054 0.221839 -0.362801
C  2.117659 0.541841 0.806019
C  -3.597062 -0.071416 -1.228107
C  2.117507 -0.072012 -1.538242
C  -3.192602 0.643444 1.5561
C  3.534047 0.572282 0.822095
C  -4.683833 0.137472 -0.353364
C  -4.484791 0.489159 1.017012
C  3.524767 -0.048014 -1.548378
C  4.239374 0.271371 -0.380862
H  -0.778282 -0.270289 -2.190176
H  1.534041 0.76639 1.705271
H  -3.757585 -0.339406 -2.277717
H  -3.033801 0.912844 2.604825
H  -5.70613 0.028171 -0.732224
H  -5.359975 0.641038 1.658324
H  4.060689 -0.280024 -2.473324
H  5.334993 0.286196 -0.401302
H  5.237467 0.920337 2.009419
H  3.718964 1.110442 2.84638
