program: Gaussian 09
title: 000278845
version: EM64L-G09RevD.01
frameworkgroup: C1[X(C20H12N6)]
method: RPBEPBE
basis: SDD
operation: Freq
keyword: #pfreq=noraman
keyword: PBEPBE/SDD
title: #p freq=noraman PBEPBE/SDD
converged: YES YES NO NO
title: Mulliken charges:
elementType: N N N N N N C C C C C C C C C C C C C C C C C C C C H H H H H H H H H H H H
charge: 0.032741 0.042631 0.067574 0.066163 -0.029180 0.000463 0.031172 -0.007454 -0.204822 -0.206348 0.369508 0.052804 0.057174 0.041881 -0.320383 -0.321806 -0.286057 -0.270290 -0.462266 -0.213330 -0.214029 -0.195449 -0.196563 -0.365151 -0.163649 -0.342958 0.271355 0.270681 0.275417 0.280948 0.255124 0.239836 0.239776 0.232664 0.243992 0.247695 0.235813 0.244321
chargesum: 0.00000
title: Mulliken charges with hydrogens summed into heavy atoms:
elementType: N N N N N N C C C C C C C C C C C C C C C C C C C C
charge: 0.032741 0.042631 0.067574 0.066163 -0.029180 0.000463 0.031172 -0.007454 -0.204822 -0.206348 0.369508 0.052804 0.057174 0.041881 -0.049029 -0.051125 -0.010640 0.010658 -0.207141 0.026506 0.025747 0.037215 0.047430 -0.117456 0.072163 -0.098636
polarizability: 5.54159430e+02 2.45757481e+00 2.70836399e+02 9.79995280e-01 3.06636916e+01 1.29339340e+02
1716.lowfreq: -8.7346 -1.2914 -0.0007 -0.0004 0.0004 4.4050 32.0443 40.9231 44.6035
frequency: 32.0146 40.9117 44.5634 49.8941 72.4617 83.0008 110.7465 137.7248 198.5022 205.3331 223.4699 242.9246 244.4621 276.1581 342.8474 344.8765 389.9322 397.5119 408.3674 425.9726 457.1348 479.2342 503.1283 511.4572 521.2280 548.5302 555.9751 572.0328 597.4132 599.0807 613.6604 624.1364 677.5877 698.8835 712.0310 720.9342 730.0906 744.4424 748.1273 775.1643 776.0263 804.9129 816.2812 828.5520 864.9024 886.0893 890.9119 908.3358 927.8966 950.6823 951.4184 966.6146 966.7382 978.4496 990.7654 1002.2381 1003.1283 1004.1019 1006.9728 1023.4250 1038.6466 1078.7068 1087.7374 1111.9675 1120.4463 1154.5177 1156.7538 1164.8468 1199.6388 1222.8349 1229.9174 1262.7363 1279.5594 1298.5780 1308.9754 1312.2863 1318.9305 1329.9863 1339.8461 1349.7322 1382.9131 1401.0243 1412.4317 1418.6510 1437.3090 1455.8170 1463.4852 1464.5519 1467.9648 1528.3410 1531.9375 1548.1941 1559.6858 1574.0059 1581.0194 1618.0531 3130.0167 3134.5884 3135.3053 3139.3439 3148.0670 3153.3211 3155.8845 3168.5944 3169.3834 3174.9871 3177.6527 3181.2190
redmass: 5.6537 5.9951 5.0966 4.5654 5.0537 5.4350 5.9336 6.5793 5.6273 4.9435 5.9537 7.0647 7.1908 5.1769 6.4147 5.1244 3.5023 3.9568 4.3628 6.3549 4.8607 3.9667 8.0105 6.1985 8.5521 3.7752 5.2148 12.2723 8.2719 8.0934 7.9157 7.5791 7.2280 8.6002 3.0047 2.9168 6.6103 4.1921 2.0195 2.5487 1.5028 2.9730 2.4361 3.1412 8.1396 1.6866 7.1301 1.3231 1.3550 2.4715 2.5421 6.0117 1.5329 1.3433 1.4326 1.4509 1.9368 3.5034 1.3965 4.0780 2.3332 3.0651 1.6864 1.7500 1.6126 2.8743 1.4807 1.0826 1.3932 2.2334 4.6977 2.6608 1.8356 4.1037 6.3978 7.1132 7.2586 1.8173 1.7816 2.9439 5.2075 2.5308 2.2763 4.1324 2.9047 3.2371 3.2865 6.1634 2.6772 9.2044 7.0029 5.7154 5.7963 5.7231 5.9315 6.3106 1.0898 1.0901 1.0882 1.0864 1.0906 1.0897 1.0920 1.0963 1.0960 1.0996 1.1004 1.0993
irintensity: 0.3268 0.4107 1.8834 6.1201 0.6212 0.5610 0.5426 1.1606 0.8914 0.7554 3.6530 0.3882 0.3822 0.8573 0.7572 0.9754 2.2144 0.6454 5.9366 1.0216 0.6741 0.0573 29.2299 7.2856 3.5928 0.3685 10.2587 1.2945 11.3492 8.2177 1.2861 1.8639 2.7856 3.0566 46.5133 6.3774 5.6603 6.9607 36.5157 37.1897 72.6116 17.4833 24.7279 24.7998 8.7828 0.0335 1.2859 0.6656 7.0620 15.5192 1.3188 9.8084 1.1786 2.1978 6.8984 1.2684 6.4989 16.9449 3.2945 4.1957 0.8371 23.8179 9.5685 6.6579 9.0352 12.1095 13.4345 1.2182 2.7242 7.7498 1.5553 21.0994 5.1217 35.3043 16.8146 5.3919 18.0869 9.8379 12.1646 143.3967 35.8821 50.0042 19.1744 9.3457 10.6708 10.5686 3.3085 27.7142 5.0315 7.5093 31.6716 14.9454 16.5830 14.0940 46.4188 1.2735 19.8885 8.2546 9.8829 3.6946 11.1944 7.6776 22.7132 26.3407 8.0440 18.9189 37.5372 12.8208
temp: 298.150 k
press: 1.00000 atm
elementType: 7 7 7 7 7 7 6 6 6 6 6 6 6 6 6 6 6 6 6 6 6 6 6 6 6 6 1 1 1 1 1 1 1 1 1 1 1 1
symmnumber: 1
zpe: 725480.0 jmol-1
zpe.correction: 0.276321 hartree
zpe.thermalcorrener: 0.295109 hartree
zpe.thermalcorrenthalpy: 0.296053 hartree
zpe.thermalcorrgfe: 0.227780 hartree
zpe.sumelectzpe: -1096.082139 hartree
zpe.sumelectthermal: -1096.063351 hartree
zpe.sumelectthermalent: -1096.062407 hartree
zpe.sumelectthermalfe: -1096.130679 hartree
dipole: 1.1622 1.6843 -0.8530
dipole: 2.2170
quadrupole: -113.1325 -134.9404 -152.0240
quadrupole: -8.2763 7.3809 6.1931
quadrupole: 20.2331 -1.5748 -18.6584 -8.2763 7.3809 6.1931
hfenergy: -1096.3584593 hartree
pointgroup: C01 [X(C20H12N6)]
dipole: 0.4436279 0.6459635 -0.3830768 debye
polarizability: 553.2702899|1.7511181|272.9765003|-19.7224794|25.0331435|128.0883787 unknown
InChI: InChI=1S/C20H12N6/c1-2-8-15-14(7-1)23-19-20(24-15)26-18(16-9-3-4-11-22-16)17(25-19)13-6-5-10-21-12-13/h1-12H
charge 0 multiplicity 1
38 atoms
N  0.254421 -1.41059 -0.29376
N  0.310828 1.425419 0.086642
N  2.590653 -1.427166 -0.603006
N  2.666119 1.384555 0.160949
N  -3.091855 1.084317 -0.930237
N  -4.161498 -1.892402 1.460353
C  -0.880282 -0.71884 -0.073283
C  -0.851283 0.75864 -0.021478
C  1.456829 -0.721001 -0.326348
C  1.493878 0.706566 0.001707
C  -2.093049 -1.531051 0.187872
C  3.773542 -0.739769 -0.489185
C  3.813886 0.667301 -0.069426
C  -2.070891 1.603688 -0.176174
C  5.006746 -1.422034 -0.764705
C  5.085894 1.316839 0.080012
C  -2.257312 -2.788671 -0.447336
C  -2.115549 2.90599 0.385815
C  -3.06681 -1.145483 1.151245
C  6.220143 -0.755719 -0.616447
C  6.260296 0.619058 -0.188457
C  -3.388616 -3.570914 -0.1416
C  -3.271183 3.689182 0.185415
C  -4.193078 1.859484 -1.125975
C  -4.334535 3.158523 -0.581819
C  -4.319829 -3.081417 0.803325
H  4.949035 -2.467902 -1.080265
H  5.08754 2.363414 0.398625
H  -1.500172 -3.125937 -1.161337
H  -1.252307 3.272738 0.947199
H  -2.96078 -0.211518 1.714497
H  7.160229 -1.278192 -0.823504
H  7.23002 1.116004 -0.077723
H  -3.552036 -4.5393 -0.624336
H  -3.341124 4.693275 0.616162
H  -4.985424 1.416978 -1.739775
H  -5.249308 3.732396 -0.759812
H  -5.222836 -3.649059 1.055068
