program: Gaussian 09
title: 000278789
version: EM64L-G09RevD.01
frameworkgroup: C1[X(C11H9NO4)]
method: RPBEPBE
basis: SDD
operation: Freq
keyword: #p
keyword: freq=noraman
keyword: PBEPBE/SDD
title: #p freq=noraman PBEPBE/SDD
converged: NO YES NO NO
title: Mulliken charges:
elementType: O O O O N C C C C C C C C C C C H H H H H H H H H
charge: -0.182777 -0.270011 -0.237587 -0.213491 0.082843 0.181858 0.195977 -0.037168 -0.396571 0.109234 0.176048 -0.217284 -0.213686 -0.124963 -0.358576 -0.670455 0.315644 0.234584 0.234618 0.250574 0.217090 0.242076 0.215756 0.233142 0.233123
chargesum: 0.00000
title: Mulliken charges with hydrogens summed into heavy atoms:
elementType: O O O O N C C C C C C C C C C C
charge: -0.182777 -0.270011 -0.237587 -0.213491 0.082843 0.181858 0.195977 -0.037168 -0.080927 0.109234 0.176048 0.251919 0.036888 0.092127 -0.116500 0.011567
polarizability: 2.57936814e+02 2.31993723e+00 1.54191994e+02 6.13370647e-03 -2.13463247e-02 6.38636857e+01
1716.lowfreq: -5.8671 -5.3939 -3.7663 -0.0006 0.0004 0.0008 31.5053 58.0794 66.4144
frequency: 31.3134 58.0501 66.3964 68.1096 88.4275 141.5066 173.8756 183.6725 238.2120 257.6402 266.6698 287.9439 356.1928 365.5219 398.6406 441.3722 469.7951 495.9224 559.7312 576.7247 623.0252 684.9352 700.3125 711.3984 723.2730 774.1892 799.7488 821.5085 834.2757 839.3983 905.8421 921.6522 944.8933 975.7615 1006.3152 1017.4398 1019.6282 1061.8909 1102.5555 1113.5793 1135.0071 1161.2278 1246.1865 1250.1660 1260.6841 1271.1453 1357.5595 1388.8299 1400.9154 1403.1246 1453.4121 1462.9261 1472.9080 1478.0158 1485.7073 1503.4079 1528.5041 1553.1035 1601.5191 1638.0079 2998.6706 3011.6374 3071.2004 3095.1887 3102.9383 3110.7175 3119.7382 3140.1528 3253.1791
redmass: 4.0062 3.3928 5.1676 4.6808 3.7470 3.4132 4.8059 5.5956 1.4523 8.5473 3.7178 6.5984 3.8383 4.9272 9.4285 8.5872 7.3037 3.8511 5.5774 6.0802 9.7737 2.8344 6.9854 3.5520 8.3197 7.0843 1.1027 4.4309 1.9296 5.6265 1.4736 8.2525 1.4508 3.2933 5.2689 1.3237 2.2923 3.1696 3.9551 2.2455 1.4643 1.9979 3.4682 1.1321 7.0295 1.5133 1.3995 1.5612 2.0351 1.2750 4.0407 1.0399 1.1122 3.2579 1.1191 8.1543 9.6845 8.2472 6.3015 11.8516 1.0360 1.0581 1.1069 1.0985 1.0856 1.1026 1.0897 1.0945 1.0993
irintensity: 2.2528 5.0249 0.9696 1.7072 1.9789 7.0097 1.4160 5.0992 0.0177 0.9044 2.4229 6.3250 13.7412 1.0035 0.5193 5.6765 3.8445 0.0601 2.5789 1.0717 0.0849 9.3592 3.6441 0.6264 10.7060 9.3927 2.8571 3.1716 58.1213 1.7047 15.4731 18.3375 0.0008 5.2993 0.4141 0.4011 47.6208 217.4006 138.6725 1.7643 6.0687 237.1596 19.5299 0.0327 271.8111 17.4657 4.5438 3.9203 7.0404 23.1359 1.4009 12.9089 6.5338 0.8970 17.5407 36.6403 105.4811 138.9534 2.1333 251.9816 19.4353 17.8965 7.5756 28.2064 3.4030 40.1022 17.4259 19.5133 7.7220
temp: 298.150 k
press: 1.00000 atm
elementType: 8 8 8 8 7 6 6 6 6 6 6 6 6 6 6 6 1 1 1 1 1 1 1 1 1
symmnumber: 1
zpe: 472902.5 jmol-1
zpe.correction: 0.180119 hartree
zpe.thermalcorrener: 0.194346 hartree
zpe.thermalcorrenthalpy: 0.195290 hartree
zpe.thermalcorrgfe: 0.137433 hartree
zpe.sumelectzpe: -779.034200 hartree
zpe.sumelectthermal: -779.019973 hartree
zpe.sumelectthermalent: -779.019029 hartree
zpe.sumelectthermalfe: -779.076885 hartree
dipole: 0.9419 1.1326 -0.0080
dipole: 1.4731
quadrupole: -53.9967 -113.0969 -91.2775
quadrupole: -11.5853 -0.0151 -0.0260
quadrupole: 32.1270 -26.9732 -5.1538 -11.5853 -0.0151 -0.0260
hfenergy: -779.2143188 hartree
pointgroup: C01 [X(C11H9N1O4)]
dipole: 0.3774176 -0.4398139 0.0043016 debye
dipolederiv: -0.1471689 -0.0485086 0.0005443 0.2541308 -0.3686819 0.0007708 -0.0000994 0.0005845 -0.1356658 -1.7407616 -0.3881128 -0.0006614 -0.8398115 -0.7701761 0.0001293 -0.0004543 0.0002865 -0.2762964 -0.2950628 -0.1935421 0.0004959 0.1257844 -1.0766026 0.00154 -0.0002676 0.0004639 -0.3429983 -0.8499295 0.2609687 -0.0007887 0.1177123 -0.899401 0.0008618 -0.0008561 0.0015047 -0.3024545 0.0002897 -0.2095118 0.0008042 0.2173814 -0.4195881 0.0007793 -0.0008337 0.000781 -0.1925584 0.115317 0.208784 -0.0002208 0.2964888 -0.5138227 0.0011728 -0.0012044 0.001185 0.0120234 -0.7025283 0.2751197 -0.0012063 -0.0521531 0.1570055 -0.0005771 -0.0004557 -0.0000322 0.0636967 0.1291774 0.1855824 -0.0010135 -0.515936 0.5373964 -0.0012712 0.001357 -0.0002472 0.1621114 -0.3035388 0.0022674 -0.0001957 0.1620405 -0.0313099 -0.0001159 -0.0003147 -0.0005588 -0.1227064 0.2499904 0.219785 -0.0002962 -0.1210622 1.2179771 -0.0011715 0.0004104 -0.0010843 0.1840022 2.3687583 -0.1500601 0.0018986 0.3593949 1.3903362 -0.0013387 0.0012636 -0.0021238 0.2532302 1.1407461 0.2099783 0.0003683 0.1733344 0.283751 0.0002831 0.0007429 0.0004256 0.3526954 0.0787026 -0.3519411 0.0009698 -0.0269535 -0.0431565 -0.0007247 0.000409 -0.0015121 -0.1004901 0.2902889 -0.0585929 0.0002514 -0.2943573 -0.0317427 -0.00005 0.0015441 0.0014399 -0.0379942 -0.1096386 0.170174 -0.0007748 0.23395 0.3267579 -0.0013289 -0.0010726 -0.001642 -0.0360611 -0.0827908 -0.0901575 -0.0000035 -0.0674488 -0.0625937 0.0000168 -0.0000552 -0.0000093 0.0573776 0.118487 -0.0062145 0.00003 -0.0539 0.1054251 0.0001494 0.000258 0.0000863 0.1754314 -0.0878172 -0.0406556 0.004946 0.0270632 0.0030465 -0.0916709 0.0420358 -0.0873124 -0.0529249 -0.0875305 -0.0408721 -0.004834 0.0267861 0.0034674 0.0915678 -0.0421173 0.0870204 -0.0533021 0.0280591 0.0344647 -0.0003492 0.0780059 0.0086198 0.0004963 -0.0003433 0.0001167 0.1345559 -0.1321505 -0.0048181 -0.0001759 -0.0206084 0.078849 0.0001498 -0.0002817 0.0003015 0.1393632 -0.0399248 -0.0876712 0.0002719 -0.0769962 -0.0051452 0.0004242 0.0002597 0.0003029 0.1175556 -0.1850074 -0.0021667 -0.0002953 0.0058796 0.075022 0.0000631 -0.0003228 0.0000489 0.1189548 0.1219101 0.0530198 0.0680254 -0.0042206 0.0171043 -0.0819261 0.0446745 -0.0983043 -0.0584679 0.1221233 0.0526811 -0.0677904 -0.0045047 0.0174623 0.0817705 -0.0442762 0.0982786 -0.0590776 unknown
polarizability: 257.9836353|-0.7152186|154.1446461|0.1414292|-0.1973062|63.8642124 unknown
InChI: InChI=1S/C11H9NO4/c1-2-15-11(14)9-6-7-8(13)4-3-5-12-10(7)16-9/h3-6H,2H2,1H3
charge 0 multiplicity 1
25 atoms
O  -0.052026 1.489527 0.000565
O  -3.176211 -0.368024 0.002198
O  1.83495 -2.791118 0.007562
O  -2.87359 1.9584 -0.001718
N  2.25861 1.787037 0.000011
C  1.08701 -0.518244 0.006477
C  -0.975406 0.433692 0.00262
C  1.237529 0.900035 0.002587
C  -0.317894 -0.793442 0.006229
C  2.141519 -1.55067 0.01022
C  -2.406116 0.797206 0.001169
C  -4.659753 -0.160334 0.000372
C  3.564709 -1.147879 0.010506
C  4.14561 0.110707 0.006641
C  3.542048 1.429985 0.00169
C  -5.296067 -1.544947 0.001083
H  -0.77653 -1.778484 0.008474
H  -4.923987 0.432318 0.894866
H  -4.922076 0.430529 -0.895864
H  4.239011 -2.015043 0.01397
H  5.243781 0.134361 0.007459
H  4.242845 2.275768 -0.001462
H  -6.396833 -1.446818 -0.000185
H  -4.998164 -2.118068 -0.893224
H  -5.000071 -2.116292 0.897158
