program: Gaussian 09
title: 000278803
version: EM64L-G09RevD.01
frameworkgroup: C1[X(C9H13N3O6)]
method: RPBEPBE
basis: SDD
operation: Freq
keyword: #p
keyword: freq=noraman
keyword: PBEPBE/SDD
title: #p freq=noraman PBEPBE/SDD
converged: NO YES NO NO
title: Mulliken charges:
elementType: O O O O O O N N N C C C C C C C C C H H H H H H H H H H H H H
charge: -0.236843 -0.417540 -0.477692 -0.426588 -0.237419 -0.351219 -0.209754 -0.182808 -0.582310 -0.154799 -0.166513 -0.151420 -0.062890 -0.391482 0.280065 -0.108607 -0.313493 0.315477 0.276384 0.287412 0.308953 0.243880 0.230630 0.216700 0.353338 0.361705 0.330346 0.237669 0.346323 0.407341 0.275155
chargesum: 0.00000
title: Mulliken charges with hydrogens summed into heavy atoms:
elementType: O O O O O O N N N C C C C C C C C C
charge: -0.236843 -0.064202 -0.115987 -0.080265 -0.237419 0.056122 -0.209754 -0.182808 -0.307155 0.121585 0.120899 0.157532 0.180990 0.055848 0.280065 0.221738 -0.075824 0.315477
polarizability: 1.94114945e+02 -1.58849356e+01 1.45779847e+02 -6.86739788e+00 -7.86442004e+00 9.20131431e+01
1716.lowfreq: -6.5635 -0.0011 -0.0011 -0.0010 6.4331 7.5565 26.3552 45.1507 62.8744
frequency: 26.1750 45.1408 62.8543 93.1188 95.9350 123.2830 142.5811 155.9372 200.1057 210.0195 241.6176 255.4725 276.0535 298.2530 304.8112 337.0264 357.3044 362.6140 367.3578 386.3583 420.9441 444.7543 491.2260 505.3400 528.6171 550.3999 626.9842 644.3048 649.2665 680.2636 695.2398 705.5567 757.2576 773.3449 795.6312 848.8872 855.6254 880.0361 907.7550 944.7340 959.7372 968.6951 983.9146 992.4384 998.7861 1008.2474 1035.4387 1044.2292 1077.0574 1102.6539 1115.2548 1136.7637 1168.2854 1197.1333 1209.8563 1220.0123 1254.4935 1258.8808 1273.8461 1289.9355 1305.4674 1320.4488 1341.4742 1355.4452 1368.1071 1370.0861 1392.2952 1409.4516 1431.5823 1467.4814 1476.0349 1567.7059 1656.9474 1667.0926 2480.1442 2985.1882 2997.8895 3037.2383 3087.6131 3088.0423 3090.0465 3112.4592 3198.9643 3509.2536 3537.6432 3565.2707 3585.7006
redmass: 6.1796 6.7530 6.5078 3.5184 5.5742 8.5634 5.3758 4.8296 6.1165 6.3791 4.4330 5.9680 3.3680 1.4799 3.6026 1.2978 1.2613 3.2448 3.4425 5.1136 3.8791 4.7950 5.7013 7.5177 5.6865 6.8017 4.9770 5.2018 4.3160 1.5635 3.2097 5.8253 5.9594 1.4388 6.9559 2.3144 1.1264 4.6563 3.7771 4.4826 3.2442 4.5731 1.6540 2.4032 2.3832 3.9908 2.7766 1.9419 2.6788 1.7162 2.6441 1.1885 3.0748 1.8423 1.3371 1.3117 1.3009 1.9165 2.0949 1.7234 1.3468 1.3580 1.2852 1.2149 2.4273 1.2551 1.4889 1.7204 1.7079 1.5144 1.0862 4.2630 5.4237 7.6433 1.0581 1.0850 1.0644 1.0868 1.0868 1.0993 1.0898 1.0975 1.0951 1.0796 1.0662 1.0664 1.0666
irintensity: 1.2215 2.3548 0.3808 0.5066 4.2709 0.4608 13.9556 1.9163 1.8800 4.8850 1.4157 10.3543 73.7621 163.9793 21.5190 54.4683 167.1526 35.2452 11.2597 34.3929 10.5890 6.2096 11.3123 3.6375 12.0414 6.2736 36.7097 13.9539 5.5672 50.2239 34.0379 20.7833 50.3622 74.6732 51.5111 17.0892 118.6444 24.4933 18.5993 31.7469 30.1788 216.6078 14.2507 6.2401 135.3488 276.9339 47.5767 9.6002 14.5539 2.7486 19.3793 33.5383 96.4569 91.7622 14.9330 12.3184 17.5154 6.9984 12.9376 90.8591 21.7506 8.0051 22.1603 12.5413 16.7532 13.3207 0.1313 1.6900 89.2028 286.8414 7.2346 79.2851 485.3936 195.9025 190.4030 22.2753 38.2380 14.1241 15.3547 23.7823 14.8617 94.1170 0.5697 41.6796 13.2455 11.8189 16.1835
temp: 298.150 k
press: 1.00000 atm
elementType: 8 8 8 8 8 8 7 7 7 6 6 6 6 6 6 6 6 6 1 1 1 1 1 1 1 1 1 1 1 1 1
symmnumber: 1
zpe: 608593.7 jmol-1
zpe.correction: 0.231801 hartree
zpe.thermalcorrener: 0.249075 hartree
zpe.thermalcorrenthalpy: 0.250019 hartree
zpe.thermalcorrgfe: 0.186469 hartree
zpe.sumelectzpe: -964.886654 hartree
zpe.sumelectthermal: -964.869379 hartree
zpe.sumelectthermalent: -964.868435 hartree
zpe.sumelectthermalfe: -964.931985 hartree
dipole: -3.9647 -6.5244 1.7252
dipole: 7.8270
quadrupole: -118.6574 -104.2268 -103.7869
quadrupole: -13.1229 4.5485 -1.5765
quadrupole: -9.7670 4.6636 5.1035 -13.1229 4.5485 -1.5765
hfenergy: -965.1184547 hartree
pointgroup: C01 [X(C9H13N3O6)]
dipole: -1.6104009 -1.4306748 2.2005545 debye
polarizability: 192.7150259|-19.6652244|116.3143098|3.8988361|-27.8422617|122.8785993 unknown
InChI: InChI=1S/C9H13N3O6/c10-5-1-2-11(9(16)12(5)17)8-7(15)6(14)4(3-13)18-8/h1-2,4,6-8,10,13-15,17H,3H2
charge 0 multiplicity 1
31 atoms
O  -1.490679 -0.036588 -1.382016
O  -2.291655 2.678594 -0.054397
O  -2.290879 -0.432199 1.959609
O  -4.871825 -1.316217 -0.396291
O  1.759201 1.404249 -1.917507
O  4.143123 0.146622 -1.164058
N  0.608907 0.315512 -0.144661
N  2.912253 -0.056758 -0.483251
N  4.273926 -1.395829 0.727104
C  -1.604121 1.487384 0.449766
C  -2.623248 0.336399 0.746373
C  -0.649541 0.918793 -0.633671
C  -2.493484 -0.633117 -0.454921
C  -3.789615 -0.829176 -1.259229
C  1.783504 0.617095 -0.941397
C  0.647051 -0.554959 0.944461
C  1.803014 -1.185854 1.343105
C  3.029415 -0.956896 0.610707
H  -1.078996 1.830202 1.354621
H  -3.640653 0.760491 0.829437
H  -0.339152 1.687812 -1.358507
H  -2.119106 -1.60693 -0.077762
H  -3.602917 -1.507202 -2.115157
H  -4.147564 0.136844 -1.651756
H  -2.662474 2.487264 -0.955218
H  -2.61271 0.051721 2.760116
H  -0.296858 -0.700621 1.481689
H  1.801207 -1.854234 2.204961
H  -4.652591 -2.22627 -0.072282
H  4.719562 -0.508329 -0.544758
H  4.480007 -2.054907 1.48669
