program: Gaussian 09
title: 000278929
version: EM64L-G09RevD.01
frameworkgroup: C1[X(C21H26Cl2N2O)]
method: RPBEPBE
basis: SDD
operation: Freq
keyword: #p
keyword: freq=noraman
keyword: PBEPBE/SDD
title: #p freq=noraman PBEPBE/SDD
converged: YES YES NO NO
title: Mulliken charges:
elementType: Cl Cl O N N C C C C C C C C C C C C C C C C C C C C C H H H H H H H H H H H H H H H H H H H H H H H H H H
charge: -0.068584 -0.069232 -0.279232 -0.134207 -0.368730 -0.557560 -0.401207 0.512442 0.443790 -0.524510 -0.419036 -0.417594 -0.472993 -0.425097 -0.379762 -0.375125 0.257963 -0.553770 -0.555624 -0.540915 0.491092 -0.372003 -0.438559 -0.230923 -0.221307 -0.242942 0.209587 0.218536 0.240019 0.205347 0.222001 0.233708 0.233659 0.273332 0.236038 0.272695 0.255256 0.227148 0.225216 0.218323 0.289673 0.261335 0.287621 0.262397 0.306830 0.224372 0.264530 0.254251 0.232239 0.231541 0.227030 0.230943
chargesum: 0.00000
title: Mulliken charges with hydrogens summed into heavy atoms:
elementType: Cl Cl O N N C C C C C C C C C C C C C C C C C C C C C
charge: -0.068584 -0.069232 -0.279232 -0.134207 -0.061900 -0.129438 0.044159 0.512442 0.443790 -0.068801 0.087955 0.091140 -0.217737 -0.197949 -0.154546 -0.156803 0.257963 -0.002761 -0.005606 -0.052014 0.491092 -0.117752 -0.206320 0.000618 0.005723 -0.011999
polarizability: 2.72711110e+02 -2.40161279e+01 2.88984025e+02 -4.38620597e+00 -6.04432267e+00 2.10993988e+02
1716.lowfreq: -11.9923 -7.4631 -3.3096 -0.0008 0.0006 0.0009 5.5971 12.4535 16.3769
frequency: 4.8216 11.1357 16.0487 20.8894 27.9629 30.7885 39.9432 48.1675 64.4712 70.0550 78.8751 89.2991 101.7681 116.9069 147.3083 179.5748 183.1009 207.6153 218.8002 257.7436 280.6682 295.3989 324.9520 341.5913 366.7276 374.2791 382.6843 404.9422 413.4900 426.6455 433.0082 464.8083 497.5555 502.7482 524.5965 552.6363 559.1485 594.9846 597.6311 602.0344 603.2144 617.2709 637.4248 642.1510 687.5662 707.8727 726.0824 755.4225 766.4331 793.9925 809.2187 812.2357 828.2752 848.5533 858.2947 865.2857 868.0612 880.5673 919.2851 921.6652 937.3457 945.4909 957.5535 979.9806 985.2938 988.9929 990.7778 997.4607 1001.1288 1005.7894 1014.5484 1025.9153 1029.0874 1045.3840 1048.2583 1085.9109 1098.5367 1126.4902 1149.0327 1158.7977 1160.8694 1170.9782 1172.2955 1181.2179 1187.1147 1204.4470 1213.0498 1224.2975 1229.0087 1231.1653 1235.9209 1259.8926 1262.9045 1291.9781 1303.3549 1309.4493 1322.9369 1332.1121 1344.4067 1346.7411 1352.4731 1354.7612 1356.0356 1374.4470 1384.6229 1385.3362 1424.5619 1438.1975 1440.0587 1440.4262 1448.5141 1456.5290 1462.7883 1463.5358 1475.5808 1480.6541 1486.7772 1488.1692 1520.1453 1565.7166 1593.8398 1611.4258 1613.7961 1631.3363 2967.6343 2971.1697 2976.4970 2987.3749 2992.8711 2996.5937 3031.9486 3047.6910 3053.0981 3053.4556 3054.4546 3060.7854 3069.5767 3076.2225 3111.8938 3114.9786 3119.7733 3121.5193 3133.3756 3142.7410 3143.8533 3145.2162 3152.0054 3156.9874 3162.7723 3546.5056
redmass: 6.8442 7.2206 5.2523 7.4828 7.0946 7.6205 6.7729 4.1253 5.0305 6.0491 5.7114 3.9557 3.9488 3.7324 4.0837 3.9887 4.3602 4.0427 4.4820 3.6779 4.0805 2.9859 2.2545 3.8446 2.6653 2.3830 3.2319 2.8260 2.9398 2.5389 2.7412 2.9334 3.3660 2.2987 2.6753 2.5314 2.4972 2.2493 4.8055 2.0268 4.2082 6.1604 5.8308 3.0906 3.0816 1.7979 3.3095 2.0751 2.9598 2.1717 1.3992 2.3266 2.0694 2.6934 1.2538 2.3859 1.8217 2.5220 1.8757 1.4168 1.4148 2.0958 1.3555 1.3932 2.0420 3.5223 3.0431 1.5109 2.1286 1.8465 2.1732 2.2381 2.6335 2.2140 2.4074 1.6199 2.9381 1.5228 1.2792 1.1512 1.1925 1.3716 1.0559 1.7685 1.1154 1.2359 2.5983 1.7243 1.5337 1.3434 1.3841 1.5297 1.2969 1.2604 1.2013 1.5249 1.2880 1.3923 1.3523 1.3886 1.3440 1.5645 1.4314 4.1921 6.2845 1.6646 2.6967 1.1100 1.1719 1.9974 1.1196 1.0933 1.1181 1.1970 1.1149 2.0381 1.8168 1.1480 2.6224 6.4131 6.0448 5.9645 5.9389 6.3283 1.0689 1.0689 1.0609 1.0599 1.0604 1.0619 1.0987 1.1014 1.0584 1.1013 1.0581 1.1022 1.0927 1.0924 1.0886 1.0872 1.0884 1.0868 1.0912 1.1098 1.1095 1.0959 1.0934 1.0938 1.1014 1.0779
irintensity: 0.3748 0.2509 1.9958 0.1657 4.6651 3.1390 1.1334 0.6227 4.5254 4.1773 1.4291 2.8490 0.8301 4.9875 0.3143 0.4968 4.2001 1.7272 2.8946 11.8514 0.2362 0.2028 4.4834 3.3072 0.7985 0.3828 3.6376 0.3577 0.4803 5.5007 15.0845 0.3035 32.9876 16.2026 15.5386 15.1565 7.2416 22.4050 19.7311 79.1667 39.0908 0.4405 1.1216 1.6171 2.4593 65.2390 1.2493 32.1010 26.8322 25.9920 3.4311 3.3826 46.9566 0.6301 1.8835 8.4735 0.2274 3.0338 56.8832 6.3855 1.7238 13.1565 0.1890 0.2374 0.4779 0.4038 1.0706 0.9094 1.8696 3.3303 9.3947 6.8857 3.7342 10.8937 1.2260 14.6828 1.5304 1.7180 25.9460 11.1420 1.3283 7.4673 0.1036 58.8052 0.6892 9.7044 3.0158 10.3688 5.3711 63.0931 89.6944 8.4920 1.1241 1.4374 25.1964 1.1211 3.4378 8.2576 5.4419 40.3000 26.7903 151.6816 4.3372 4.0578 2.2544 14.9731 6.8285 5.1652 6.9911 26.8773 14.3609 13.7846 31.2796 41.3158 6.9578 58.8104 92.6626 0.6064 240.2261 8.3340 2.1472 137.6946 33.5214 112.4246 38.6217 17.8227 35.3065 30.8431 42.0777 22.5651 27.7735 20.9123 25.0097 8.8628 12.4303 52.0704 2.2363 8.5907 18.0227 7.6820 15.7572 2.6894 10.1249 20.2623 23.5994 37.5618 22.3846 9.9077 20.4580 12.2587
temp: 298.150 k
press: 1.00000 atm
elementType: 17 17 8 7 7 6 6 6 6 6 6 6 6 6 6 6 6 6 6 6 6 6 6 6 6 6 1 1 1 1 1 1 1 1 1 1 1 1 1 1 1 1 1 1 1 1 1 1 1 1 1 1
symmnumber: 1
zpe: 1122105.1 jmol-1
zpe.correction: 0.427387 hartree
zpe.thermalcorrener: 0.453752 hartree
zpe.thermalcorrenthalpy: 0.454696 hartree
zpe.thermalcorrgfe: 0.362565 hartree
zpe.sumelectzpe: -1918.763917 hartree
zpe.sumelectthermal: -1918.737552 hartree
zpe.sumelectthermalent: -1918.736608 hartree
zpe.sumelectthermalfe: -1918.828739 hartree
dipole: -2.1721 1.3948 0.7725
dipole: 2.6945
quadrupole: -198.6303 -155.0689 -173.6850
quadrupole: 21.3438 -0.9501 -2.7026
quadrupole: -22.8356 20.7258 2.1098 21.3438 -0.9501 -2.7026
hfenergy: -1919.191304 hartree
pointgroup: C01 [X(C21H26Cl2N2O1)]
dipole: -0.812664 0.4839437 0.4786879 debye
polarizability: 268.7059349|-19.4252027|286.6098835|-10.1197213|23.5363598|217.3733044 unknown
InChI: InChI=1S/C21H26Cl2N2O/c22-13-15-25(16-14-23)20-11-9-18(10-12-20)7-4-8-21(26)24-17-19-5-2-1-3-6-19/h1-3,5-6,9-12,24H,4,7-8,13-17H2
charge 0 multiplicity 1
52 atoms
Cl -6.270465 1.579872 -1.560434
Cl -4.117579 1.20176 3.449696
O  4.102316 -2.644022 -0.03603
N  -3.673122 0.477625 0.230338
N  2.880025 -1.168756 1.287103
C  0.98241 -2.357465 -1.861952
C  1.402557 -3.579814 -0.99684
C  -0.233543 -1.609402 -1.329701
C  -2.547286 -0.204155 -0.280071
C  1.762932 -3.213056 0.46353
C  -4.992712 -0.163229 0.269405
C  -3.557759 1.845936 0.748563
C  -0.139297 -0.283159 -0.840187
C  -1.51539 -2.214478 -1.286026
C  -1.256231 0.407615 -0.325798
C  -2.644569 -1.541368 -0.781369
C  3.012519 -2.33026 0.538374
C  -5.741992 -0.174313 -1.071933
C  -2.951699 1.95234 2.156404
C  3.991225 -0.217945 1.479394
C  3.743914 1.133849 0.816901
C  3.589207 1.220842 -0.591814
C  3.671891 2.319675 1.587856
C  3.364708 2.467833 -1.213594
C  3.447537 3.571679 0.967684
C  3.291673 3.648598 -0.434764
H  0.784673 -2.721058 -2.890195
H  1.841928 -1.663994 -1.937273
H  2.28067 -4.065283 -1.462163
H  0.581962 -4.323196 -0.981189
H  0.899859 -2.728868 0.9577
H  1.986407 -4.143098 1.021274
H  -4.896669 -1.215012 0.610251
H  -5.609484 0.342227 1.030968
H  -2.934368 2.462249 0.06762
H  -4.557121 2.311493 0.742634
H  0.828983 0.232369 -0.863539
H  -1.641487 -3.237314 -1.664272
H  -1.106716 1.431704 0.029236
H  -3.603215 -2.068657 -0.786788
H  -5.117636 -0.524906 -1.905819
H  -6.67933 -0.749538 -1.009742
H  -2.012907 1.390361 2.259605
H  -2.819353 3.002032 2.462607
H  1.958102 -0.922432 1.652465
H  4.176728 -0.081118 2.561911
H  4.876277 -0.714564 1.039937
H  3.662197 0.307518 -1.195082
H  3.796161 2.265322 2.676994
H  3.254197 2.522781 -2.302501
H  3.397693 4.482001 1.575926
H  3.120581 4.617077 -0.918006
