program: Gaussian 09
title: 000280256
version: EM64L-G09RevD.01
frameworkgroup: C1[X(C10H17NO)]
method: RPBEPBE
basis: SDD
operation: Freq
keyword: #p
keyword: freq=noraman
keyword: PBEPBE/SDD
title: #p freq=noraman PBEPBE/SDD
converged: NO NO NO NO
title: Mulliken charges:
elementType: O N C C C C C C C C C C H H H H H H H H H H H H H H H H H
charge: -0.265241 -0.402736 0.311936 -0.572254 -0.528367 -0.737164 -0.722099 0.452876 0.139652 -0.540918 -0.314527 -0.722290 0.241605 0.206092 0.237109 0.223899 0.209827 0.209144 0.223083 0.216516 0.198712 0.241119 0.260271 0.299071 0.228093 0.227011 0.221220 0.222542 0.235817
chargesum: 0.00000
title: Mulliken charges with hydrogens summed into heavy atoms:
elementType: O N C C C C C C C C C C
charge: -0.265241 -0.103665 0.311936 -0.124558 -0.067359 -0.095110 -0.065751 0.452876 0.139652 -0.280647 0.140578 -0.042712
polarizability: 1.49617932e+02 -1.38508596e+01 1.26780484e+02 2.05020129e+00 3.53663743e+00 8.66126514e+01
1716.lowfreq: -0.0011 -0.0010 -0.0003 5.5096 10.3336 17.0553 49.7016 84.6207 112.1169
frequency: 49.4718 84.5663 112.1129 120.6738 168.3668 187.6864 215.5405 243.7779 257.1272 279.2726 288.9039 318.8073 338.8455 367.4739 406.7959 425.1447 463.9679 478.3805 525.6948 546.5044 589.2013 640.0931 788.5956 806.4069 845.1522 860.9742 885.4875 897.8044 910.1359 933.1040 937.3018 970.9809 990.1839 1014.5691 1067.3085 1122.1010 1136.4849 1144.8446 1154.7158 1173.5359 1255.8033 1262.5271 1267.4570 1269.2296 1290.8318 1299.1276 1327.1353 1336.0978 1371.3025 1377.2470 1395.4737 1395.7754 1433.3551 1443.8071 1467.1978 1472.4701 1477.1218 1479.4253 1482.8385 1490.5942 1498.4007 1504.8803 1559.1280 1619.5052 2950.5621 2959.0776 2963.3767 2965.6942 2974.2377 2984.4544 2999.9720 3003.2071 3053.4350 3058.6660 3064.6221 3071.0862 3077.8672 3084.2534 3097.1229 3156.2563 3547.6469
redmass: 2.8604 2.2521 2.9275 3.4762 2.2453 3.6041 1.0760 1.5815 1.3308 1.4945 2.3257 2.4488 2.8823 2.5098 1.2227 2.4610 3.3786 3.5932 3.4431 2.4749 3.3415 4.8932 2.9341 1.1558 1.5427 3.1148 1.8521 2.1420 1.8968 1.9667 1.4753 2.0425 1.8624 1.3766 2.5693 1.5464 1.7810 1.5108 1.7371 2.0204 1.9413 1.3563 1.1368 2.1494 1.9396 1.6022 5.0185 1.7500 1.6683 1.2106 1.2123 1.2338 1.0852 1.0859 1.0498 1.0624 1.0404 1.0739 1.0579 1.0615 1.2008 1.5962 8.7043 5.8371 1.0582 1.0584 1.0593 1.0394 1.0378 1.0365 1.1040 1.1006 1.0955 1.0989 1.0988 1.0986 1.1009 1.0991 1.0984 1.0904 1.0773
irintensity: 0.0180 3.2393 0.2383 1.6289 2.1841 1.8302 0.1316 0.9996 1.4540 0.9018 0.7741 0.4223 0.7378 2.5816 71.4365 7.0039 1.6844 2.7728 12.6693 3.7421 4.0537 5.8645 1.1400 16.1203 11.5229 10.7655 5.2834 3.5147 3.2497 3.0894 1.6122 4.2405 4.1879 0.0874 1.4886 6.9474 11.2806 2.1871 13.4825 18.1353 62.7217 43.5549 1.1718 34.3688 8.1322 2.3514 60.0189 4.2450 4.7279 20.6566 20.8841 27.9860 12.5811 4.2842 4.2135 9.0302 13.8449 55.2371 7.3681 4.9432 137.8433 100.9147 178.2581 414.8255 32.0569 31.3076 19.9097 46.7468 26.2968 28.7119 21.2323 23.1333 8.5910 27.7851 33.8090 48.7350 45.0504 31.2022 26.7545 13.1535 41.5268
temp: 298.150 k
press: 1.00000 atm
elementType: 8 7 6 6 6 6 6 6 6 6 6 6 1 1 1 1 1 1 1 1 1 1 1 1 1 1 1 1 1
symmnumber: 1
zpe: 661154.3 jmol-1
zpe.correction: 0.251820 hartree
zpe.thermalcorrener: 0.265120 hartree
zpe.thermalcorrenthalpy: 0.266064 hartree
zpe.thermalcorrgfe: 0.212841 hartree
zpe.sumelectzpe: -520.295017 hartree
zpe.sumelectthermal: -520.281718 hartree
zpe.sumelectthermalent: -520.280774 hartree
zpe.sumelectthermalfe: -520.333997 hartree
dipole: 3.9288 -5.9689 -0.5180
dipole: 7.1646
quadrupole: -63.3401 -87.6150 -74.5949
quadrupole: 5.8623 0.8613 0.1857
quadrupole: 11.8432 -12.4316 0.5884 5.8623 0.8613 0.1857
hfenergy: -520.5468378 hartree
pointgroup: C01 [X(C10H17N1O1)]
dipole: 1.5737403 -2.3283809 -0.217899 debye
polarizability: 149.9013738|-13.6351016|126.3894821|2.2894442|3.889068|86.7202114 unknown
InChI: InChI=1S/C10H17NO/c1-4-11-8-5-9(12)7-10(2,3)6-8/h5,11H,4,6-7H2,1-3H3
charge 0 multiplicity 1
29 atoms
O  -1.346545 2.827205 0.092418
N  2.039158 -0.613067 -0.113459
C  -1.724476 -0.887926 0.031199
C  -0.304905 -1.233315 -0.504897
C  -2.073984 0.553057 -0.436581
C  -2.747952 -1.892781 -0.554202
C  -1.756285 -0.975361 1.580652
C  0.735155 -0.167684 -0.183077
C  -1.008305 1.607389 -0.092069
C  0.375465 1.16371 -0.007108
C  3.20016 0.257602 0.120113
C  4.503939 -0.558369 0.114086
H  -0.35868 -1.351458 -1.607316
H  0.01981 -2.212626 -0.094491
H  -3.033031 0.889491 -0.002689
H  -2.200466 0.559749 -1.540229
H  -2.755828 -1.860804 -1.660438
H  -2.514499 -2.92932 -0.242056
H  -3.769052 -1.65686 -0.201757
H  -2.764368 -0.722052 1.957678
H  -1.515298 -2.000929 1.921117
H  -1.036524 -0.277717 2.043355
H  1.118494 1.935703 0.2165
H  2.213909 -1.613395 -0.221579
H  3.236079 1.041634 -0.663707
H  3.082876 0.780929 1.091352
H  4.499184 -1.325703 0.910286
H  4.656221 -1.061412 -0.858791
H  5.368348 0.104014 0.289989
