program: Gaussian 09
title: 000280259
version: EM64L-G09RevD.01
frameworkgroup: C1[X(C14H9Cl3O2)]
method: RPBEPBE
basis: SDD
operation: Freq
keyword: #p
keyword: freq=noraman
keyword: PBEPBE/SDD
title: #p freq=noraman PBEPBE/SDD
converged: YES YES NO NO
title: Mulliken charges:
elementType: Cl Cl Cl O O C C C C C C C C C C C C C C H H H H H H H H H
charge: 0.000248 0.000005 -0.028708 -0.312696 -0.199940 0.251769 0.446787 -0.329881 -0.319330 -0.377709 -0.372974 0.624548 0.150105 -0.802053 -0.233060 -0.231415 -0.233883 -0.234575 -0.087563 0.266999 0.273069 0.238413 0.237176 0.230258 0.230317 0.242830 0.285653 0.285608
chargesum: 0.00000
title: Mulliken charges with hydrogens summed into heavy atoms:
elementType: Cl Cl Cl O O C C C C C C C C C C C C C C
charge: 0.000248 0.000005 -0.028708 -0.312696 -0.199940 0.251769 0.446787 -0.062881 -0.046260 -0.139296 -0.135798 0.624548 0.150105 -0.098649 -0.233060 -0.231415 0.051770 0.051033 -0.087563
polarizability: 3.03682125e+02 -5.28726001e-01 1.53046661e+02 -1.03275838e+01 -5.17131103e-01 1.25054780e+02
1716.lowfreq: -28.1965 -0.0017 0.0005 0.0018 4.0911 4.9580 8.1295 17.0699 22.6764
frequency: -28.0047 16.6000 22.4667 32.1172 56.7446 90.1980 106.4955 121.6904 146.2176 174.3139 192.9255 196.8008 247.3681 252.3828 296.4172 338.8153 342.1761 349.9622 393.5380 406.3531 408.5224 464.9841 474.6583 506.4458 542.1299 547.5486 594.8123 632.7295 669.3477 670.4504 709.7206 737.0595 759.9804 774.9389 797.4214 832.9170 846.6306 853.0220 859.9095 860.7784 967.4910 984.8876 991.5146 995.9958 1019.0965 1044.9286 1047.4793 1105.1513 1126.5450 1184.4596 1187.4518 1211.9071 1225.3568 1247.0085 1310.4795 1354.1097 1372.2110 1377.8901 1396.9158 1413.9517 1427.5162 1468.3627 1473.1177 1502.9094 1563.3473 1575.9359 1577.2701 1621.4371 1664.4217 2978.5170 3061.0193 3092.0723 3131.6320 3134.7133 3161.0023 3180.3218 3188.8548 3190.3038
redmass: 1.0281 7.3847 7.0891 12.2214 5.4112 9.0688 4.8272 11.1308 11.2300 24.2521 14.5560 4.8705 6.3871 6.2154 7.6279 3.6952 7.3241 27.3377 8.3989 2.8687 7.9169 6.6319 2.9706 5.0194 5.2363 7.0172 5.3688 6.9058 4.7437 5.9119 8.7575 3.0111 11.1315 8.1643 6.9112 7.3726 1.5379 1.4360 1.3681 1.2489 5.9389 1.3383 1.5345 1.3805 2.7026 3.2255 1.7195 2.6376 1.3015 1.4664 1.2758 3.1476 2.9070 3.7347 1.2767 5.8177 4.9653 4.7372 1.2194 3.6153 3.4898 1.1057 1.0586 2.6493 9.6689 8.4849 6.4811 6.2986 12.5873 1.0392 1.0941 1.1001 1.0891 1.0902 1.0960 1.0950 1.0933 1.0940
irintensity: 0.6335 0.0285 0.9101 0.4261 0.3695 0.4008 0.0490 0.0032 0.2929 0.3433 1.4742 0.0080 6.8897 0.5514 2.4575 2.5210 1.2175 0.2695 9.6867 0.0901 5.0723 5.0364 11.8625 0.0073 8.2120 2.0133 6.5029 2.2855 18.8332 0.9475 42.0963 10.9276 85.3138 7.1608 72.6620 8.1590 33.6759 43.6330 0.0371 0.3738 453.9310 2.3927 57.2378 0.7984 28.7316 64.5731 14.0742 60.2547 8.2758 4.4331 200.9405 253.4051 1.9302 107.7605 0.7807 15.9969 23.2123 4.6728 15.2070 13.4316 186.4241 15.7675 13.3139 12.4047 71.5899 37.8021 19.8098 106.3126 229.2059 23.0196 19.9714 15.4865 12.9661 16.1955 8.0423 1.7885 2.7947 0.9068
temp: 298.150 k
press: 1.00000 atm
elementType: 17 17 17 8 8 6 6 6 6 6 6 6 6 6 6 6 6 6 6 1 1 1 1 1 1 1 1 1
symmnumber: 1
zpe: 495763.4 jmol-1
zpe.correction: 0.188826 hartree
zpe.thermalcorrener: 0.206050 hartree
zpe.thermalcorrenthalpy: 0.206994 hartree
zpe.thermalcorrgfe: 0.140241 hartree
zpe.sumelectzpe: -2068.186029 hartree
zpe.sumelectthermal: -2068.168806 hartree
zpe.sumelectthermalent: -2068.167861 hartree
zpe.sumelectthermalfe: -2068.234615 hartree
dipole: 3.1714 -0.0323 -1.6330
dipole: 3.5672
quadrupole: -103.0552 -130.2411 -130.6140
quadrupole: -0.4566 -0.5964 -0.0182
quadrupole: 18.2483 -8.9377 -9.3106 -0.4566 -0.5964 -0.0182
hfenergy: -2068.3748558 hartree
pointgroup: C01 [X(C14H9Cl3O2)]
dipole: 1.2502266 0.2212499 -0.5980697 debye
polarizability: 303.7447754|1.9662244|149.2903044|-9.5594955|9.5934127|128.7484859 unknown
InChI: InChI=1S/C14H9Cl3O2/c1-8-2-4-9(5-3-8)14(18)19-13-11(16)6-10(15)7-12(13)17/h2-7H,1H3
charge 0 multiplicity 1
28 atoms
Cl -1.444137 2.681126 0.83023
Cl -1.482165 -2.439091 -1.324989
Cl -6.258712 0.033001 0.047577
O  -0.244898 0.182497 -0.410971
O  0.098636 -0.758752 1.715653
C  2.019881 -0.158646 0.323254
C  4.804852 0.069444 -0.237079
C  2.979949 -0.586914 1.27831
C  2.456152 0.386258 -0.912594
C  4.353219 -0.47059 0.997748
C  3.833543 0.497239 -1.181766
C  -1.639154 0.119202 -0.239828
C  0.588524 -0.29917 0.667701
C  6.28606 0.164078 -0.549071
C  -2.357185 1.222217 0.276404
C  -2.37372 -1.012295 -0.662908
C  -3.761645 1.216739 0.371879
C  -3.77845 -1.059433 -0.583837
C  -4.44597 0.066208 -0.064386
H  2.62945 -1.001862 2.229265
H  1.714706 0.719045 -1.643526
H  5.088013 -0.799945 1.741533
H  4.164886 0.922361 -2.136325
H  6.503381 0.99792 -1.238774
H  6.886346 0.306617 0.366173
H  6.643671 -0.765036 -1.03441
H  -4.297546 2.079503 0.773158
H  -4.327287 -1.943423 -0.915517
