program: Gaussian 09
title: 000280241
version: EM64L-G09RevD.01
frameworkgroup: C1[X(C11H16N2O2)]
method: RPBEPBE
basis: SDD
operation: Freq
keyword: #p
keyword: freq=noraman
keyword: PBEPBE/SDD
title: #p freq=noraman PBEPBE/SDD
converged: YES YES NO NO
title: Mulliken charges:
elementType: O O N N C C C C C C C C C C C H H H H H H H H H H H H H H H H
charge: -0.452246 -0.294715 -0.076720 -0.715985 -0.517222 -0.413433 0.148177 -0.509789 0.246104 0.399828 -0.086293 -0.624927 0.237450 -0.646068 -0.525218 0.231676 0.195707 0.216021 0.192826 0.168482 0.262961 0.230224 0.225336 0.185858 0.240465 0.316313 0.306625 0.361142 0.266450 0.208251 0.222719
chargesum: 0.00000
title: Mulliken charges with hydrogens summed into heavy atoms:
elementType: O O N N C C C C C C C C C C C
charge: -0.091104 -0.294715 -0.076720 -0.093046 -0.089838 -0.004586 0.148177 -0.078346 0.246104 0.399828 -0.086293 0.016490 0.237450 -0.405603 0.172202
polarizability: 1.80268333e+02 -5.35504105e+00 1.63790122e+02 1.21315917e+00 2.97534877e+00 8.31151126e+01
1716.lowfreq: -9.1627 0.0007 0.0008 0.0010 5.4500 7.9536 63.5796 75.5003 96.4356
frequency: 63.5521 75.4745 96.4281 132.6079 149.5710 170.5721 198.7454 216.1191 230.1200 250.3784 250.9492 266.2950 295.3971 306.5556 319.1908 328.5149 351.6108 360.0931 391.3552 400.0889 435.7784 474.1913 535.2953 556.8371 583.7670 651.7351 668.8920 691.7261 717.5075 784.3315 828.3795 852.9072 910.0329 964.3798 973.6179 993.2216 1017.9832 1050.4047 1059.5116 1072.3330 1098.4724 1113.0678 1114.7580 1146.4383 1156.4503 1172.1521 1194.1535 1204.4419 1213.0370 1244.8114 1260.3645 1292.9078 1334.7231 1339.5759 1364.7255 1376.1315 1403.5277 1421.7693 1432.9702 1443.0981 1452.0426 1455.6911 1460.9365 1465.0901 1479.7193 1481.4342 1485.5018 1499.5141 1602.1848 1621.0062 1640.3895 2716.0909 2836.7902 2853.1448 2945.8422 2969.8012 2985.8200 2994.6217 3018.2763 3035.3740 3078.1820 3078.6998 3122.4292 3147.7851 3557.7400 3578.4045 3718.2155
redmass: 3.5840 2.5101 2.8976 2.6950 1.4373 3.7219 2.2009 2.4941 1.5212 1.2969 1.6809 1.4256 3.4555 3.0615 2.7119 2.4793 1.4861 2.5192 3.4285 3.4790 4.3195 5.8215 3.5504 3.5064 3.6472 6.1760 4.2496 5.3264 3.0226 3.5910 2.7649 1.7451 3.2156 3.3746 2.2217 1.9942 2.5137 1.8791 1.8361 2.2951 2.4175 1.2416 1.3485 2.2800 1.3722 1.8605 1.2947 2.0182 1.6878 1.5689 1.5782 1.6197 1.6982 1.9017 2.0947 2.1938 3.0130 2.3804 1.1841 1.6632 1.1650 1.0602 1.1352 1.0665 1.1145 1.1014 1.0601 3.6568 7.7221 3.2174 1.4671 1.0707 1.0673 1.0609 1.0585 1.0354 1.0830 1.1004 1.0719 1.0890 1.1007 1.0960 1.1047 1.0916 1.0662 1.0449 1.1034
irintensity: 1.1376 5.0794 2.0970 12.7717 3.1743 2.5910 0.1238 26.0445 1.7178 73.5190 58.7581 162.7806 32.2145 6.4740 3.4689 6.2022 71.8801 4.7356 7.0288 6.1289 1.6639 1.3271 3.8275 2.5157 1.6893 2.3964 1.6113 19.6375 2.3375 15.4567 14.5656 38.0810 15.6924 31.9777 5.3779 2.2931 39.4316 10.3020 12.6576 49.8428 8.2990 9.9367 10.6336 53.2237 21.0526 254.6889 8.9808 10.2377 2.9232 32.0889 9.7260 1.5959 8.4356 17.1784 2.1707 43.6780 12.6061 28.3541 2.1408 14.9175 41.0713 6.0151 26.3867 12.8873 12.3226 0.5219 37.2113 117.0550 37.4655 17.1453 243.0120 111.1149 52.3566 213.5485 47.7490 94.3657 19.4820 33.8051 49.2800 51.1653 32.4077 38.0123 19.2027 9.3317 15.8521 48.1672 20.2739
temp: 298.150 k
press: 1.00000 atm
elementType: 8 8 7 7 6 6 6 6 6 6 6 6 6 6 6 1 1 1 1 1 1 1 1 1 1 1 1 1 1 1 1
symmnumber: 1
zpe: 671612.0 jmol-1
zpe.correction: 0.255803 hartree
zpe.thermalcorrener: 0.271303 hartree
zpe.thermalcorrenthalpy: 0.272247 hartree
zpe.thermalcorrgfe: 0.214564 hartree
zpe.sumelectzpe: -687.542067 hartree
zpe.sumelectthermal: -687.526567 hartree
zpe.sumelectthermalent: -687.525623 hartree
zpe.sumelectthermalfe: -687.583306 hartree
dipole: -2.8441 0.8356 0.0129
dipole: 2.9643
quadrupole: -85.4313 -71.9413 -93.9284
quadrupole: 0.8490 6.4548 2.8139
quadrupole: -1.6643 11.8257 -10.1614 0.8490 6.4548 2.8139
hfenergy: -687.7978705 hartree
pointgroup: C01 [X(C11H16N2O2)]
dipole: -1.1102492 -0.356304 0.0235603 debye
polarizability: 179.9048192|5.7501845|164.1519642|-3.2575452|1.1480778|83.1167843 unknown
InChI: InChI=1S/C11H16N2O2/c1-13-4-3-7-8(6-13)11(14)10(15-2)5-9(7)12/h5,14H,3-4,6,12H2,1-2H3
charge 0 multiplicity 1
31 atoms
O  1.195184 2.242013 0.188278
O  3.420136 0.382801 0.200202
N  -2.797146 0.668794 -0.372873
N  0.3722 -3.356565 -0.108021
C  -1.986421 -1.639012 -0.048472
C  -3.017777 -0.581169 0.38419
C  -0.569927 -1.08581 -0.030373
C  -1.508893 1.297868 -0.028664
C  -0.348777 0.310956 0.005392
C  0.55526 -1.967243 -0.048015
C  0.965473 0.835821 0.098182
C  -3.914974 1.62249 -0.27782
C  2.081799 -0.03869 0.071261
C  1.866782 -1.429128 -0.011804
C  3.876447 1.457789 -0.704548
H  -2.249942 -1.994364 -1.066191
H  -2.06725 -2.509146 0.637347
H  -4.040864 -0.941412 0.171186
H  -2.944733 -0.41367 1.490841
H  -1.577339 1.821137 0.972994
H  -1.296251 2.085968 -0.778458
H  -4.847351 1.139452 -0.619491
H  -3.720979 2.490402 -0.934242
H  -4.083537 2.00886 0.760711
H  2.747949 -2.079135 -0.036281
H  -0.54701 -3.761899 -0.245865
H  1.175578 -3.977044 -0.105853
H  0.48766 2.662832 0.737642
H  3.296954 2.381744 -0.546804
H  3.789509 1.13378 -1.760437
H  4.936043 1.613886 -0.448819
