program: Gaussian 09
title: 000280244
version: EM64L-G09RevD.01
frameworkgroup: C1[X(C14H15NO3)]
method: RPBEPBE
basis: SDD
operation: Freq
keyword: #p
keyword: freq=noraman
keyword: PBEPBE/SDD
title: #p freq=noraman PBEPBE/SDD
converged: YES YES NO NO
title: Mulliken charges:
elementType: O O O N C C C C C C C C C C C C C C H H H H H H H H H H H H H H H
charge: -0.194386 -0.266560 -0.266282 -0.112772 -0.063899 -0.564850 -0.526981 -0.504280 -0.358750 0.327831 0.294781 -0.501873 0.171110 -0.526264 -0.511104 0.182887 0.171484 -0.204416 0.232609 0.217323 0.229025 0.225722 0.238888 0.239701 0.196506 0.195491 0.221524 0.236938 0.230919 0.259965 0.257402 0.231792 0.240516
chargesum: 0.00000
title: Mulliken charges with hydrogens summed into heavy atoms:
elementType: O O O N C C C C C C C C C C C C C C
charge: -0.194386 -0.266560 -0.266282 -0.112772 0.168711 -0.118502 -0.062371 -0.068073 0.058265 0.327831 0.294781 -0.034015 0.171110 -0.266299 -0.253702 0.182887 0.171484 0.267893
polarizability: 2.41088590e+02 7.30172624e-01 1.51910354e+02 2.57791562e+00 -9.96660972e-01 9.60861193e+01
1716.lowfreq: -12.5454 -3.6358 0.0002 0.0004 0.0007 9.2309 33.2429 62.9497 79.8460
frequency: 33.2045 62.9274 79.8415 94.0078 137.6857 149.4008 173.4999 190.1500 255.7013 263.5035 272.4433 293.2066 345.2662 390.4459 414.2083 419.0156 435.2237 482.0272 494.2794 507.5576 540.1336 620.0239 649.1653 677.2669 701.4918 709.8344 725.3026 743.4805 757.2933 780.6918 814.5708 837.5472 845.4977 861.6072 868.8721 918.0524 958.2837 973.4343 976.7273 990.5391 1010.7882 1036.4109 1062.0744 1070.4877 1089.2158 1112.6171 1119.9798 1126.7616 1159.6577 1165.3125 1189.5754 1192.2966 1213.9788 1225.3192 1232.5442 1248.3857 1255.2582 1276.0883 1279.5788 1301.1220 1311.9578 1338.2570 1342.8986 1344.8129 1362.3125 1385.6540 1425.2672 1429.3360 1432.9480 1437.1360 1449.1676 1462.2374 1475.4044 1483.5795 1487.0377 1625.7008 1631.2525 1642.2157 2805.8747 2833.7019 2845.6481 2966.1857 2977.2535 2997.6647 2997.8770 2998.6921 3026.3649 3027.2138 3075.8815 3088.4061 3105.9379 3156.5822 3161.4075
redmass: 5.3418 4.8547 2.4478 3.8570 3.4651 4.8374 3.8144 2.5247 4.3866 5.3367 2.5245 4.6966 5.7951 2.8995 3.6657 3.1364 3.4454 2.9853 3.1381 3.2384 4.8090 6.0693 5.4883 9.0530 3.5670 4.0231 3.6953 4.7494 4.4682 2.4522 2.9387 5.4278 2.7632 1.4110 1.4782 2.0427 2.2730 4.5960 2.0559 1.8989 3.4514 2.6883 2.4213 1.4914 2.7260 2.3212 3.3240 1.0624 1.9197 1.6804 1.9417 1.4102 1.4121 1.4393 1.4772 1.8205 1.3883 2.9670 1.4637 1.3257 1.4494 1.3696 1.7036 1.5704 1.2861 1.6102 1.1612 3.3222 3.2426 1.1936 1.1711 1.1479 1.7689 1.1049 1.5230 7.9010 9.1015 9.3526 1.0719 1.0796 1.0723 1.0619 1.0629 1.0643 1.0618 1.0825 1.0982 1.0876 1.0969 1.0996 1.1104 1.0927 1.0930
irintensity: 0.4172 4.4229 17.4349 0.1849 1.2970 0.1645 0.8630 4.2672 0.6608 0.8689 8.7023 1.5365 0.2868 3.5696 2.5107 7.4799 5.7499 3.0432 8.2187 0.9411 2.8370 1.1853 0.3251 0.5577 4.5447 0.2319 5.9296 9.8816 0.8439 7.1772 21.2813 24.3448 5.5631 11.3893 30.5590 9.7052 1.4316 133.8307 28.6558 3.8458 5.7011 12.7975 3.0691 7.5044 6.3684 47.7876 4.1245 0.5268 9.4685 44.1355 38.0619 0.8533 37.9311 44.4808 24.4200 31.5693 24.2426 92.8249 28.7154 2.7280 22.3094 34.5392 47.1911 35.9965 1.5724 2.7839 9.8171 4.3903 2.4438 9.8606 18.5075 34.0468 124.6871 6.4393 62.3551 1.4210 1.1747 214.7795 53.8297 33.0485 147.8067 28.2969 13.9241 75.6528 60.5886 35.9534 18.7862 40.4282 17.7626 20.7095 32.2474 5.8646 2.0393
temp: 298.150 k
press: 1.00000 atm
elementType: 8 8 8 7 6 6 6 6 6 6 6 6 6 6 6 6 6 6 1 1 1 1 1 1 1 1 1 1 1 1 1 1 1
symmnumber: 1
zpe: 693491.5 jmol-1
zpe.correction: 0.264137 hartree
zpe.thermalcorrener: 0.278985 hartree
zpe.thermalcorrenthalpy: 0.279929 hartree
zpe.thermalcorrgfe: 0.221764 hartree
zpe.sumelectzpe: -821.559293 hartree
zpe.sumelectthermal: -821.544445 hartree
zpe.sumelectthermalent: -821.543501 hartree
zpe.sumelectthermalfe: -821.601666 hartree
dipole: 2.6643 1.3092 1.0600
dipole: 3.1522
quadrupole: -119.7226 -101.2649 -106.8575
quadrupole: -8.1940 -5.1933 -1.7674
quadrupole: -10.4409 8.0168 2.4242 -8.1940 -5.1933 -1.7674
hfenergy: -821.8234302 hartree
pointgroup: C01 [X(C14H15N1O3)]
dipole: 1.0535646 0.5103489 0.4093137 debye
polarizability: 241.1212675|0.2694045|151.9018169|1.6198277|-1.1014077|96.0619788 unknown
InChI: InChI=1S/C14H15NO3/c16-12-1-2-15-7-10-5-14-13(17-8-18-14)4-9(10)3-11(15)6-12/h4-5,11H,1-3,6-8H2
charge 0 multiplicity 1
33 atoms
O  -5.474123 -0.857646 -0.647081
O  4.385616 -1.28698 -0.080664
O  4.439661 1.106588 -0.255795
N  -1.813025 0.788933 0.308867
C  -1.881328 -0.5792 -0.279861
C  -0.676842 -1.410489 0.211191
C  -3.196162 -1.293609 0.140967
C  -0.59309 1.525414 -0.114056
C  -3.004255 1.614224 -0.013867
C  0.656357 -0.699235 0.054618
C  0.691291 0.713503 -0.049574
C  -4.311694 0.970051 0.501817
C  -4.44125 -0.438973 -0.060854
C  1.866693 -1.456251 0.059648
C  1.933069 1.408038 -0.152315
C  3.068243 -0.757845 -0.032063
C  3.100562 0.649345 -0.135821
C  5.27862 -0.099371 -0.024226
H  -1.855891 -0.521398 -1.400052
H  -0.661362 -2.378118 -0.326803
H  -0.840744 -1.641028 1.283826
H  -3.122721 -1.521171 1.224553
H  -3.30636 -2.244888 -0.407527
H  -0.500034 2.421789 0.529237
H  -0.709077 1.90275 -1.166384
H  -3.094143 1.781637 -1.119243
H  -2.872061 2.607401 0.454232
H  -5.19077 1.571287 0.214872
H  -4.26217 0.909331 1.606526
H  1.849046 -2.547512 0.133951
H  1.968956 2.49814 -0.239984
H  5.73034 -0.035755 0.983987
H  6.026842 -0.17466 -0.828222
