program: Gaussian 09
title: 000280208
version: EM64L-G09RevD.01
frameworkgroup: C1[X(C8H9NO2)]
method: RPBEPBE
basis: SDD
operation: Freq
keyword: #pfreq=noraman
keyword: PBEPBE/SDD
title: #p freq=noraman PBEPBE/SDD
converged: NO NO NO YES
title: Mulliken charges:
elementType: O O N C C C C C C C C H H H H H H H H H
charge: -0.403124 -0.240837 -0.003738 0.473872 0.345389 -0.029808 0.140581 -0.486303 -0.520629 -0.778364 -0.847518 0.262589 0.264005 0.209899 0.252700 0.252650 0.236174 0.236221 0.260018 0.376221
chargesum: 0.00000
title: Mulliken charges with hydrogens summed into heavy atoms:
elementType: O O N C C C C C C C C
charge: -0.026903 -0.240837 -0.003738 0.473872 0.345389 -0.029808 0.140581 -0.223713 -0.256624 -0.063115 -0.115105
polarizability: 1.66150053e+02 4.62274570e+00 1.07536994e+02 -7.60425947e-03 2.86903954e-03 5.05233949e+01
1716.lowfreq: -0.0004 0.0005 0.0007 11.3355 12.1052 13.4517 84.6340 123.6847 163.1569
frequency: 84.6303 123.6794 163.1295 190.3965 209.1898 224.7269 282.5741 285.8278 312.3536 364.2448 376.2975 393.7564 438.1228 460.4971 498.3961 613.1304 623.9869 714.5660 728.9056 757.1666 795.9415 880.9709 919.9887 980.8127 1010.5934 1036.6562 1048.2350 1067.9574 1139.3492 1155.4850 1206.6168 1258.0623 1277.8928 1324.4396 1379.9384 1398.6009 1406.3672 1425.8610 1447.4241 1458.5080 1480.0049 1481.7897 1499.7521 1554.2812 1637.9252 2959.2895 2989.6075 3028.7354 3074.5074 3091.7173 3094.8840 3143.4493 3155.5592 3565.0594
redmass: 5.5929 3.2898 1.0817 1.8308 1.9266 6.8161 2.6835 3.3211 3.0870 4.4174 8.7337 1.2444 4.2680 2.8109 5.0687 4.3147 4.5178 6.3351 3.3358 6.8824 3.5894 1.3788 1.3620 1.5842 1.4351 1.5857 1.4966 4.9648 1.6592 2.0122 2.7187 1.3593 3.6306 10.4422 2.7847 1.3748 1.3219 3.2247 1.0465 1.1454 1.0431 1.2504 3.7349 5.7845 7.0072 1.0403 1.0363 1.0981 1.0952 1.1017 1.0946 1.0915 1.0921 1.0655
irintensity: 1.7334 1.7786 0.0034 0.0484 3.7824 3.6022 5.3342 0.6401 6.8466 10.7683 0.0823 108.0693 9.1798 18.0435 10.9409 3.8258 1.3708 2.8441 0.0760 14.9750 12.0335 11.0064 20.5886 5.2335 9.0329 8.4959 8.7755 240.9490 188.8459 1.3878 38.9923 49.0465 140.9203 104.0166 1.5121 25.5266 21.0377 0.7199 12.5118 37.4656 16.3538 19.9636 59.4554 105.5739 69.2768 32.1789 15.0513 20.4262 8.6141 23.9877 8.0986 4.1195 4.9090 70.3616
temp: 298.150 k
press: 1.00000 atm
elementType: 8 8 7 6 6 6 6 6 6 6 6 1 1 1 1 1 1 1 1 1
symmnumber: 1
zpe: 402075.9 jmol-1
zpe.correction: 0.153143 hartree
zpe.thermalcorrener: 0.163841 hartree
zpe.thermalcorrenthalpy: 0.164785 hartree
zpe.thermalcorrgfe: 0.117536 hartree
zpe.sumelectzpe: -514.575536 hartree
zpe.sumelectthermal: -514.564837 hartree
zpe.sumelectthermalent: -514.563893 hartree
zpe.sumelectthermalfe: -514.611142 hartree
dipole: 5.5393 0.7287 0.0004
dipole: 5.5870
quadrupole: -64.9065 -64.8563 -65.5943
quadrupole: -12.7029 -0.0011 -0.0016
quadrupole: 0.2125 0.2627 -0.4752 -12.7029 -0.0011 -0.0016
hfenergy: -514.7286784 hartree
pointgroup: C01 [X(C8H9N1O2)]
dipole: 2.1970886 -0.0213476 0.0630396 debye
dipolederiv: -1.5064001 0.4006266 -0.0478733 0.4759355 -0.2783275 0.0084674 -0.0510052 0.0063486 -0.4023215 -1.2631028 0.2943478 -0.0435063 -0.5863498 -0.1889406 -0.0152941 -0.0075265 0.0096961 -0.1549039 1.6728985 -0.5015524 0.0736026 -0.0151945 0.119687 -0.0131636 0.053235 -0.0268775 -0.1966806 0.4755456 0.2078691 0.0037516 -0.177642 0.273252 -0.0143396 0.019369 -0.0033349 0.047104 -0.1490167 0.2975695 -0.0136519 0.6038524 -0.2388848 0.0228225 -0.0263671 0.0140554 -0.1010795 -0.9600549 0.2233657 -0.0384375 0.523083 -0.3232697 0.0308949 -0.0500818 0.0222806 0.0698566 1.4468757 -0.3072532 0.0505137 -0.4430645 0.4385049 -0.0258683 0.0560335 -0.0220503 0.1160596 0.4675296 -0.2252261 0.0252493 0.0650081 0.0269584 -0.0031195 0.0135421 -0.0114653 -0.0948298 -0.7101853 -0.1064774 -0.0103342 -0.2498784 0.0353104 -0.0165112 -0.0044876 -0.0124288 -0.1916708 -0.1602912 -0.2836271 0.0063213 -0.1224661 0.0645509 -0.0049967 -0.0001783 -0.0098622 0.0316752 -0.0426138 -0.0573496 -0.0015348 -0.0599417 -0.0223409 0.0032406 -0.0012696 0.0033859 0.0971705 0.1062164 0.0163024 -0.0018559 -0.0153622 -0.0412767 0.0073177 -0.0006071 0.0081771 0.1473672 0.0774933 0.0080343 -0.0026129 0.0328834 -0.0620088 0.0100406 -0.0036465 0.0094038 0.1580276 0.0655951 0.1463782 -0.0072335 0.0062191 -0.147821 0.0107174 -0.0012843 0.0147818 0.0995706 0.0454073 -0.0016186 0.0845619 0.0224172 0.0469324 -0.0473352 0.0692806 -0.0013384 -0.0057298 0.0539763 -0.0085665 -0.0805957 0.0138516 0.0505684 0.0429924 -0.0674006 -0.0041041 -0.0184605 -0.0406483 -0.0513486 -0.0950837 0.0049444 0.073368 0.0576416 -0.119341 0.0047371 -0.0488866 -0.0527251 -0.0428441 0.0984804 0.0181007 0.0673704 -0.0660596 0.1179405 -0.016453 -0.0308053 0.0825904 0.1197349 -0.006035 -0.0041463 -0.0705483 0.0077982 -0.0009653 0.0113083 0.1224747 0.3909099 -0.1283649 0.0062739 -0.0922498 0.1769157 0.0047544 0.0047603 0.0037398 0.3560625 unknown
polarizability: 166.3158406|2.6036602|107.1880949|3.1848363|-2.253617|50.7065064 unknown
InChI: InChI=1S/C8H9NO2/c1-5-4-8(10)6(2)3-7(5)9-11/h3-4,10H,1-2H3
charge 0 multiplicity 1
20 atoms
O  2.879787 -1.114395 0.100308
O  -3.355562 0.412887 -0.139586
N  -2.28098 1.132165 -0.138199
C  -0.815767 -1.003152 -0.009409
C  1.414024 0.870508 -0.022856
C  -1.0220 0.42197 -0.073882
C  1.605666 -0.543771 0.040664
C  0.086055 1.317484 -0.079087
C  0.517972 -1.450199 0.047093
C  -1.945052 -2.01098 0.000389
C  2.600267 1.817493 -0.028331
H  -0.146699 2.38746 -0.12948
H  0.743667 -2.520193 0.097769
H  -1.544546 -3.038202 0.055725
H  -2.627917 -1.839516 0.850994
H  -2.576763 -1.914163 -0.900086
H  3.213724 1.725424 0.890743
H  3.263752 1.651776 -0.901124
H  2.259262 2.863818 -0.080692
H  3.587309 -0.421115 0.091847
