program: Gaussian 09
title: 000280235
version: EM64L-G09RevD.01
frameworkgroup: C1[X(C17H19NO3)]
method: RPBEPBE
basis: SDD
operation: Freq
keyword: #p
keyword: freq=noraman
keyword: PBEPBE/SDD
title: #p freq=noraman PBEPBE/SDD
converged: YES YES NO NO
title: Mulliken charges:
elementType: O O O N C C C C C C C C C C C C C C C C C H H H H H H H H H H H H H H H H H H H
charge: -0.286825 -0.451792 -0.435142 -0.309981 -0.328609 0.299123 -0.495133 0.294443 -0.545584 0.560482 -0.531721 -0.549923 -0.556238 -0.478617 0.203445 0.172478 0.346369 -0.388434 0.124005 -0.792531 -0.523586 0.249016 0.231597 0.204380 0.196348 0.230239 0.269331 0.276824 0.214169 0.253186 0.235828 0.213707 0.235777 0.240219 0.216093 0.356810 0.261224 0.208699 0.227486 0.352838
chargesum: 0.00000
title: Mulliken charges with hydrogens summed into heavy atoms:
elementType: O O O N C C C C C C C C C C C C C C C C C
charge: -0.286825 -0.094982 -0.082303 -0.040650 -0.079593 0.299123 -0.059156 0.294443 -0.118997 0.560482 -0.254897 -0.335754 -0.303052 -0.242788 0.203445 0.172478 0.346369 -0.174728 0.124005 -0.100441 0.173824
polarizability: 2.49075790e+02 1.20013028e+01 2.05196903e+02 1.98404864e+01 2.59673524e-01 1.58032406e+02
1716.lowfreq: -6.4838 -3.3207 -0.0006 -0.0006 -0.0004 7.4157 22.5381 37.0951 39.2224
frequency: 22.2289 37.0932 39.1988 53.3073 94.3501 101.9814 116.3515 135.5608 152.2270 183.5421 200.3091 221.8727 245.2021 251.7186 278.5702 288.8405 299.0578 300.2413 320.9557 366.3096 371.5714 375.9882 403.9651 428.7336 440.1372 443.9307 461.1654 465.8723 529.6441 546.7370 579.4276 590.7022 601.3405 634.9462 674.8363 702.4727 721.0077 730.7853 737.0924 750.5148 792.0490 802.4601 815.7027 826.7573 899.6607 903.8440 926.7534 932.1859 951.3703 956.3682 985.0777 1001.2599 1009.5418 1047.8028 1048.9442 1089.0797 1092.1382 1112.0798 1135.2858 1149.8958 1153.8292 1161.8577 1173.9808 1186.9805 1194.3718 1211.3645 1224.0777 1243.0689 1253.4104 1256.2255 1271.6451 1281.4286 1293.4844 1312.9110 1320.8549 1367.2634 1389.2191 1391.6818 1400.3410 1402.9337 1417.0484 1435.1186 1444.6775 1455.3787 1458.7626 1463.6183 1473.1693 1474.9884 1480.6556 1501.2666 1509.4574 1591.0642 1607.0851 1618.9110 1620.3062 2817.5226 2862.4134 2971.9434 2974.8078 2983.1692 3007.1666 3048.8463 3061.1550 3079.8605 3086.0512 3092.2362 3105.5170 3121.6698 3123.6423 3133.6935 3152.1171 3472.4308 3578.7817 3580.6307
redmass: 3.7382 4.4085 5.4038 2.1950 3.1480 3.1127 1.0441 1.9598 3.4577 2.8892 3.4429 3.3768 5.1848 4.8816 3.0677 4.2666 4.0174 2.6661 1.1987 1.6516 2.3149 3.7059 4.2112 4.0723 3.1815 3.2468 3.5881 2.6448 5.1617 4.2276 3.6485 3.2965 3.3103 4.5325 4.6883 3.9852 3.0650 4.5098 4.1278 4.4240 3.0239 1.6583 2.7475 1.7345 1.4650 1.5044 1.3778 4.3953 2.9508 2.4262 1.9486 2.2274 2.0324 1.8705 1.9659 2.1083 2.8862 1.2419 2.1930 1.6585 1.4274 1.6938 1.4078 1.2403 1.6489 2.2295 1.4784 1.8382 1.3684 1.7526 1.7166 1.4696 3.0486 1.5016 1.5879 2.0133 4.3414 3.9667 2.7233 1.3837 2.5592 1.2702 1.3625 1.0612 1.0451 1.0915 1.1253 1.3045 1.0551 2.4263 3.2314 7.2557 6.6787 6.3837 7.2449 1.0713 1.0703 1.0349 1.0823 1.0365 1.0859 1.0903 1.0969 1.0971 1.0903 1.1002 1.0874 1.0912 1.1044 1.0961 1.0912 1.0755 1.0659 1.0659
irintensity: 0.2998 0.8335 1.2824 5.5875 1.1260 0.8243 0.0684 1.9423 1.3851 2.7426 1.3082 3.4680 1.9248 5.0226 5.3748 7.0678 3.6677 7.6016 108.5910 83.6102 44.8661 23.1895 10.9223 0.3137 8.3975 12.3385 9.6561 54.5445 34.5718 5.1310 31.7918 26.1421 15.2529 31.0111 12.9597 18.9724 5.6425 7.3525 10.3439 4.1334 7.5846 38.8052 30.0699 7.5982 9.6525 16.2187 0.6200 37.2834 11.3591 15.0693 12.0055 1.4467 11.8998 11.0916 19.3025 243.2235 64.1530 4.4768 57.5712 23.3205 26.2675 38.6640 55.4448 4.7354 9.6909 61.7666 12.5259 35.5468 7.2405 124.7569 41.1278 20.3740 55.1335 26.3429 17.4902 11.2466 11.5538 5.2736 34.5214 13.6315 6.9554 2.2768 1.9977 13.2049 10.4373 2.7642 17.4726 4.3353 27.6965 93.7147 124.6031 16.0913 1.1784 11.6645 4.8321 102.9236 93.9517 91.7636 22.2146 27.6418 38.6340 37.1696 16.5005 36.6504 26.9859 15.9734 22.2679 16.8151 17.8166 13.7042 2.2733 1.0457 35.9783 33.4991
temp: 298.150 k
press: 1.00000 atm
elementType: 8 8 8 7 6 6 6 6 6 6 6 6 6 6 6 6 6 6 6 6 6 1 1 1 1 1 1 1 1 1 1 1 1 1 1 1 1 1 1 1
symmnumber: 1
zpe: 847399.5 jmol-1
zpe.correction: 0.322757 hartree
zpe.thermalcorrener: 0.342827 hartree
zpe.thermalcorrenthalpy: 0.343771 hartree
zpe.thermalcorrgfe: 0.273541 hartree
zpe.sumelectzpe: -938.066245 hartree
zpe.sumelectthermal: -938.046176 hartree
zpe.sumelectthermalent: -938.045232 hartree
zpe.sumelectthermalfe: -938.115462 hartree
dipole: 0.9938 2.5369 -0.3606
dipole: 2.7484
quadrupole: -99.4890 -118.6135 -118.2632
quadrupole: 4.2615 13.3368 8.8913
quadrupole: 12.6329 -6.4916 -6.1413 4.2615 13.3368 8.8913
hfenergy: -938.3890029 hartree
pointgroup: C01 [X(C17H19N1O3)]
dipole: -0.4933706 0.9420939 0.1955596 debye
polarizability: 248.000165|-9.9496453|202.7556468|24.8555364|4.9271735|161.5492871 unknown
InChI: InChI=1S/C17H19NO3/c1-10-5-11(3-4-15(10)19)14-9-18-8-12-6-16(20)17(21-2)7-13(12)14/h3-7,14,18-20H,8-9H2,1-2H3
charge 0 multiplicity 1
40 atoms
O  -2.013314 -2.961438 -0.1843
O  -4.241201 -1.590784 -1.417104
O  5.423808 -1.125255 -0.056428
N  -1.012559 3.406899 0.343055
C  0.265823 1.336274 0.763832
C  -0.933982 0.586532 0.163155
C  0.317722 2.786895 0.207319
C  -2.017938 1.287667 -0.430192
C  -2.012846 2.808055 -0.558119
C  1.613003 0.642927 0.57008
C  -1.007675 -0.825746 0.249209
C  -3.116472 0.557753 -0.941834
C  2.049129 0.221813 -0.714933
C  2.488959 0.458511 1.664563
C  -2.101187 -1.558724 -0.252174
C  -3.168849 -0.84897 -0.873167
C  3.313253 -0.367558 -0.933883
C  3.762175 -0.126441 1.482821
C  4.166388 -0.53245 0.192261
C  3.768878 -0.822055 -2.304454
C  -3.184275 -3.697323 0.335414
H  0.083189 1.431573 1.853761
H  1.053283 3.373156 0.785876
H  0.675192 2.751806 -0.852749
H  -1.830014 3.065891 -1.635313
H  -3.011806 3.20727 -0.298009
H  -0.991571 4.431633 0.290344
H  -0.189616 -1.394874 0.702428
H  -3.949627 1.101382 -1.411994
H  1.372518 0.335537 -1.57096
H  2.17622 0.770925 2.668325
H  4.431143 -0.267535 2.342321
H  4.69967 -0.307431 -2.606581
H  3.997766 -1.903674 -2.308476
H  2.993934 -0.625446 -3.06452
H  -4.880578 -0.98474 -1.867013
H  -4.061986 -3.56194 -0.317251
H  -3.423985 -3.364293 1.364302
H  -2.869433 -4.752107 0.349312
H  5.938165 -1.212714 0.784074
